{"text_format":"1","workbook":"xlsx","n_sheets":13,"sheets":["INFO","RANKING","ESTADOS","F1","QF","SF","F","CLASS","RESUMO","SUM-F1","SUM-QF","SUM-SF","SUM-FN"],"not_rendered":{"charts":0,"images":5,"macros":1,"external_links":1,"defined_names":39,"comments":1,"pivot_tables":0},"unopened":[],"bounds":{"document_bytes":16777216,"sheet_cells":100000,"rows_first":2000,"rows_last":500,"rows_between":2000,"halvings":0,"cell_chars":16384,"cell_head_chars":4096},"cells_cut":0,"cells_raw":0,"read":"whole","date_system":"1900"}

{"sheet":"INFO","index":0,"n_rows":40,"n_cols":6,"rows_kept":40,"cut":false,"hidden":false,"merged":[[0,0,0,1],[0,2,0,5],[1,0,1,1],[1,2,1,5],[2,0,2,1],[2,2,2,5],[3,0,3,1],[3,2,3,5],[7,0,7,5],[9,0,11,0],[9,2,11,2],[9,4,11,4],[13,0,15,0],[13,2,15,2],[13,4,15,4],[17,0,19,0],[17,2,19,2],[17,4,19,4],[21,0,23,0],[21,2,23,2],[21,4,23,4],[25,0,27,0],[25,2,27,2],[25,4,27,4],[29,0,31,0],[29,2,31,2],[29,4,31,4],[33,0,35,0],[33,2,35,2],[33,4,39,5],[37,0,39,0],[37,2,39,2]]}
["COMPETIÇÃO:",null,"32o CAMPEONATO BRASILEIRO INDIVIDUAL"]
["LOCAL:",null,"SÃO PAULO/SP"]
["DATA:",null,"16 a 19/junho de 2022"]
["CATEGORIA:",null,"SUB-18"]
[]
["FONTE UTILIZADA:","ARIAL"]
[]
["CORES UTILIZADAS:"]
[]
[null,"R: 255","1a Divisão (Série Ouro)","R: 255","5a Divisão (Copa)","R: 0"]
[null,"G: 255",null,"G: 192",null,"G: 176"]
[null,"B: 0",null,"B: 0",null,"B: 240"]
[]
[null,"R: 0",{"$f":"$C$10","v":"1a Divisão (Série Ouro)"},"R: 255",{"$f":"$E$10","v":"5a Divisão (Copa)"},"R: 204"]
[null,"G: 96",null,"G: 226",null,"G: 236"]
[null,"B: 39",null,"B: 133",null,"B: 255"]
[]
[null,"R: 0","2a Divisão (Série Prata)","R: 191","6a Divisão","R: 54"]
[null,"G: 255",null,"G: 191",null,"G: 96"]
[null,"B: 0",null,"B: 191",null,"B: 146"]
[]
[null,"R: 0",{"$f":"$C$18","v":"2a Divisão (Série Prata)"},"R: 234",{"$f":"$E$18","v":"6a Divisão"},"R: 255"]
[null,"G: 32",null,"G: 234",null,"G: 255"]
[null,"B: 96",null,"B: 234",null,"B: 204"]
[]
[null,"R: 54","3a Divisão (Série Bronze)","R: 247","7a Divisão","R: 255"]
[null,"G: 96",null,"G: 150",null,"G: 0"]
[null,"B: 146",null,"B: 70",null,"B: 255"]
[]
[null,"R: 184",{"$f":"$C$26","v":"3a Divisão (Série Bronze)"},"R: 250",{"$f":"$E$26","v":"7a Divisão"},"R: 255"]
[null,"G: 204",null,"G: 191",null,"G: 255"]
[null,"B: 228",null,"B: 143",null,"B: 204"]
[]
[null,null,"4a Divisão (Série Extra)","R: 0"]
[null,null,null,"G: 176"]
[null,null,null,"B: 80"]
[]
[null,null,{"$f":"$C$34","v":"4a Divisão (Série Extra)"},"R: 204"]
[null,null,null,"G: 255"]
[null,null,null,"B: 204"]

{"sheet":"RANKING","index":1,"n_rows":17,"n_cols":6,"rows_kept":17,"cut":false,"hidden":false,"merged":[]}
["POS.","ATLETAS","ESTADO","SIGLA"]
[1,"LEO LIMA","SAO PAULO",{"$f":"VLOOKUP($C2,ESTADOS!$A$2:$B$28,2,FALSE)","v":"SP"},null,">>> Atenção <<<"]
[2,"PEDRO ANTONIO","SAO PAULO",{"$f":"VLOOKUP($C3,ESTADOS!$A$2:$B$28,2,FALSE)","v":"SP"},null," Para completar o cálculo da 1a Fase proceda da seguinte forma:"]
[3,"TUGUINHA","SAO PAULO",{"$f":"VLOOKUP($C4,ESTADOS!$A$2:$B$28,2,FALSE)","v":"SP"},null," 1) Coloque os Botonistas do mesmo Estado/Clube dentro"]
[4,"CAROL","SAO PAULO",{"$f":"VLOOKUP($C5,ESTADOS!$A$2:$B$28,2,FALSE)","v":"SP"},null," de cada bloco."]
[5,"IGOR COSTA","SAO PAULO",{"$f":"VLOOKUP($C6,ESTADOS!$A$2:$B$28,2,FALSE)","v":"SP"},null,"• 2 botonistas: posições 1 e 4 ou 2 e 3 ou 5 e 8 ou 6 e 7"]
[6,"VITOR HUGO","SAO PAULO",{"$f":"VLOOKUP($C7,ESTADOS!$A$2:$B$28,2,FALSE)","v":"SP"},null,"                            ou 9 e 12 ou 10 e 11 ou 13 e 16 ou 14 e 15."]
[7,"TUSURINHA","SAO PAULO",{"$f":"VLOOKUP($C8,ESTADOS!$A$2:$B$28,2,FALSE)","v":"SP"},null,"• 3 botonistas: posições 1, 2 e 4 ou 5, 6 e 8 ou"]
[8,"LUIZ GULHERME","SAO PAULO",{"$f":"VLOOKUP($C9,ESTADOS!$A$2:$B$28,2,FALSE)","v":"SP"},null,"                           9, 10 e 12 ou 13, 14 e 16."]
[9,"PEDRINHO","SAO PAULO",{"$f":"VLOOKUP($C10,ESTADOS!$A$2:$B$28,2,FALSE)","v":"SP"},null,"• 4 botonistas: posições 1 a 4 ou 5 a 8 ou 9 a 12 ou 13 a 16."]
[10,"WALLACE RINCO","SAO PAULO",{"$f":"VLOOKUP($C11,ESTADOS!$A$2:$B$28,2,FALSE)","v":"SP"}]
[11,"DAVI ANDRADE","SAO PAULO",{"$f":"VLOOKUP($C12,ESTADOS!$A$2:$B$28,2,FALSE)","v":"SP"}]
[12,"MELLI JR","SAO PAULO",{"$f":"VLOOKUP($C13,ESTADOS!$A$2:$B$28,2,FALSE)","v":"SP"}]
[13,"RODRIGO","PERNAMBUCO",{"$f":"VLOOKUP($C14,ESTADOS!$A$2:$B$28,2,FALSE)","v":"PE"}]
[14,"LINNO BALA","PERNAMBUCO",{"$f":"VLOOKUP($C15,ESTADOS!$A$2:$B$28,2,FALSE)","v":"PE"}]
[15,"DANIEL COUTO","RIO DE JANEIRO",{"$f":"VLOOKUP($C16,ESTADOS!$A$2:$B$28,2,FALSE)","v":"RJ"}]
[16,"VERISSON","PERNAMBUCO",{"$f":"VLOOKUP($C17,ESTADOS!$A$2:$B$28,2,FALSE)","v":"PE"}]

{"sheet":"ESTADOS","index":2,"n_rows":28,"n_cols":2,"rows_kept":28,"cut":false,"hidden":false,"merged":[]}
["ESTADO","SIGLA"]
["ACRE","AC"]
["ALAGOAS","AL"]
["AMAPA","AP"]
["AMAZONAS","AM"]
["BAHIA","BA"]
["CEARA","CE"]
["DISTRITO FEDERAL","DF"]
["ESPIRITO SANTO","ES"]
["GOIAS","GO"]
["MARANHAO","MA"]
["MATO GROSSO","MT"]
["MATO GROSSO DO SUL","MS"]
["MINAS GERAIS","MG"]
["PARA","PA"]
["PARAIBA","PB"]
["PARANA","PR"]
["PERNAMBUCO","PE"]
["PIAUI","PI"]
["RIO DE JANEIRO","RJ"]
["RIO GRANDE DO NORTE","RN"]
["RIO GRANDE DO SUL","RS"]
["RONDONIA","RO"]
["RORAIMA","RR"]
["SANTA CATARINA","SC"]
["SAO PAULO","SP"]
["SERGIPE","SE"]
["TOCANTINS","TO"]

{"sheet":"F1","index":3,"n_rows":163,"n_cols":66,"rows_kept":163,"cut":false,"hidden":false,"merged":[[5,51,5,65],[7,51,7,59],[162,2,162,3],[162,13,162,14],[68,4,68,8],[68,11,68,15],[77,4,77,8],[77,11,77,15],[86,4,86,8],[86,11,86,15],[5,46,5,49],[7,46,7,49],[144,2,144,6],[39,4,39,8],[39,11,39,15],[40,4,40,8],[40,11,40,15],[7,33,7,44],[6,17,6,18],[142,17,142,18],[13,11,13,15],[48,4,48,8],[48,11,48,15],[30,4,30,8],[80,1,87,1],[8,1,15,1],[15,4,15,8],[15,11,15,15],[6,4,6,15],[8,4,8,8],[8,11,8,15],[12,4,12,8],[12,11,12,15],[8,2,11,2],[12,2,15,2],[9,4,9,8],[10,4,10,8],[11,4,11,8],[9,11,9,15],[10,11,10,15],[11,11,11,15],[35,11,35,15],[13,4,13,8],[24,4,24,8],[24,11,24,15],[17,4,17,8],[14,4,14,8],[14,11,14,15],[44,1,51,1],[53,1,60,1],[57,2,60,2],[55,4,55,8],[55,11,55,15],[56,4,56,8],[56,11,56,15],[35,4,35,8],[162,7,162,9],[44,4,44,8],[44,11,44,15],[49,4,49,8],[49,11,49,15],[51,4,51,8],[51,11,51,15],[35,1,42,1],[42,4,42,8],[42,11,42,15],[60,4,60,8],[60,11,60,15],[71,1,78,1],[71,4,71,8],[71,11,71,15],[75,4,75,8],[17,1,24,1],[22,4,22,8],[22,11,22,15],[26,1,33,1],[33,4,33,8],[33,11,33,15],[26,4,26,8],[26,11,26,15],[31,4,31,8],[30,11,30,15],[17,11,17,15],[21,4,21,8],[21,11,21,15],[23,4,23,8],[23,11,23,15],[32,4,32,8],[32,11,32,15],[31,11,31,15],[18,4,18,8],[18,11,18,15],[19,4,19,8],[19,11,19,15],[20,4,20,8],[20,11,20,15],[62,1,69,1],[62,4,62,8],[62,11,62,15],[66,4,66,8],[66,11,66,15],[67,4,67,8],[67,11,67,15],[69,4,69,8],[69,11,69,15],[62,2,65,2],[66,2,69,2],[63,4,63,8],[63,11,63,15],[64,4,64,8],[65,11,65,15],[89,1,96,1],[89,4,89,8],[89,11,89,15],[93,4,93,8],[93,11,93,15],[94,4,94,8],[94,11,94,15],[95,4,95,8],[95,11,95,15],[96,4,96,8],[96,11,96,15],[89,2,92,2],[93,2,96,2],[90,4,90,8],[90,11,90,15],[91,4,91,8],[91,11,91,15],[92,4,92,8],[92,11,92,15],[98,1,105,1],[98,4,98,8],[98,11,98,15],[102,4,102,8],[102,11,102,15],[103,4,103,8],[103,11,103,15],[104,4,104,8],[104,11,104,15],[105,4,105,8],[105,11,105,15],[99,4,99,8],[99,11,99,15],[100,4,100,8],[100,11,100,15],[101,4,101,8],[101,11,101,15],[98,2,101,2],[102,2,105,2],[107,1,114,1],[107,4,107,8],[107,11,107,15],[111,4,111,8],[111,11,111,15],[112,4,112,8],[112,11,112,15],[113,4,113,8],[113,11,113,15],[114,4,114,8],[114,11,114,15],[107,2,110,2],[111,2,114,2],[108,4,108,8],[108,11,108,15],[109,4,109,8],[109,11,109,15],[110,4,110,8],[110,11,110,15],[116,1,123,1],[116,4,116,8],[116,11,116,15],[120,4,120,8],[120,11,120,15],[121,4,121,8],[121,11,121,15],[122,4,122,8],[122,11,122,15],[123,4,123,8],[123,11,123,15],[116,2,119,2],[120,2,123,2],[117,4,117,8],[117,11,117,15],[118,4,118,8],[118,11,118,15],[119,4,119,8],[119,11,119,15],[134,1,141,1],[134,4,134,8],[125,1,132,1],[125,4,125,8],[125,11,125,15],[141,4,141,8],[141,11,141,15],[136,11,136,15],[137,4,137,8],[137,11,137,15],[129,4,129,8],[129,11,129,15],[130,4,130,8],[130,11,130,15],[131,4,131,8],[131,11,131,15],[134,2,137,2],[138,2,141,2],[135,4,135,8],[135,11,135,15],[136,4,136,8],[37,4,37,8],[37,11,37,15],[134,11,134,15],[138,4,138,8],[138,11,138,15],[139,4,139,8],[139,11,139,15],[125,2,128,2],[129,2,132,2],[126,4,126,8],[126,11,126,15],[127,4,127,8],[127,11,127,15],[128,4,128,8],[128,11,128,15],[71,2,74,2],[75,2,78,2],[85,4,85,8],[85,11,85,15],[87,4,87,8],[87,11,87,15],[80,2,83,2],[84,2,87,2],[81,4,81,8],[84,11,84,15],[65,4,65,8],[59,11,59,15],[132,4,132,8],[132,11,132,15],[81,11,81,15],[82,4,82,8],[82,11,82,15],[83,4,83,8],[83,11,83,15],[17,2,20,2],[21,2,24,2],[26,2,29,2],[30,2,33,2],[35,2,38,2],[39,2,42,2],[44,2,47,2],[48,2,51,2],[53,2,56,2],[27,4,27,8],[27,11,27,15],[28,4,28,8],[28,11,28,15],[29,4,29,8],[29,11,29,15],[36,4,36,8],[36,11,36,15],[140,4,140,8],[140,11,140,15],[53,4,53,8],[53,11,53,15],[57,4,57,8],[57,11,57,15],[58,4,58,8],[58,11,58,15],[75,11,75,15],[76,4,76,8],[76,11,76,15],[78,4,78,8],[78,11,78,15],[80,4,80,8],[80,11,80,15],[84,4,84,8],[2,1,2,15],[3,1,3,15],[72,4,72,8],[72,11,72,15],[73,4,73,8],[73,11,73,15],[74,4,74,8],[74,11,74,15],[38,4,38,8],[38,11,38,15],[45,4,45,8],[45,11,45,15],[46,4,46,8],[46,11,46,15],[47,4,47,8],[47,11,47,15],[54,4,54,8],[54,11,54,15],[41,4,41,8],[41,11,41,15],[50,4,50,8],[50,11,50,15],[59,4,59,8],[64,11,64,15]]}
[]
[]
[]
[null,"                            32o CAMPEONATO BRASILEIRO INDIVIDUAL"]
[]
[null,{"$f":"CONCATENATE(INFO!$C$4, \" | \", \"1a Divisão\")","v":"SUB-18 | 1a Divisão"},null,null,null,null,null,null,null,null,null,null,null,null,null,"1a Fase",null,null,null,null,null,null,null,null,null,null,null,null,null,null,null,null,null,null,null,null,null,null,null,null,null,null,null,null,null,null,"POSIÇÃO DOS ATLETAS",null,null,null,null,"SEQUÊNCIA | CASA x FORA"]
["Grp","Rod.","Data/Hora","Mesas","Jogos",null,null,null,null,null,null,null,null,null,null,null,null,"Critérios",null,null,"OK",null,"MV","ME","MD","MGP","MGC","VV","VE","VD","VGP","VGC",null,"Col.","Sort","Atleta","PG","J","V","E","D","GP","GC","SG","Chave Sorteiro",null,"COL.","ATLETA","CASA","FORA",null,1,2,3,4,5,6,7,8,9,10,11,12,13,14,15]
[null,null,null,null,null,null,null,null,null,null,null,null,null,null,null,null,null,null,null,null,null,null,null,null,null,null,null,null,null,null,null,null,null,null,null,null,null,null,null,null,null,null,null,null,null,null,null,null,null,null,null,{"$f":"IF(COUNTIF($E$18:$I$25,$Z8)=0,\"\",IF(COUNTIF($E$18:$E$25,$Z8)=1,\"C\",\"F\"))","v":""}]
[1,1,"2022-06-17",57,{"$f":"VLOOKUP($R9,$AU$9:$AV$24,2,0)","v":"LEO LIMA (SP)"},null,null,null,null,9,1,{"$f":"VLOOKUP($S9,$AU$9:$AV$24,2,0)","v":"CAROL (SP)"},null,null,null,null,null,1,4,null,{"$f":"COUNTBLANK(J9:K9)","v":0},null,{"$f":"IF(OR(J9=\"\",K9=\"\"),\"\",IF(OR(E9=\"WO\",L9=\"WO\"),\"\",IF(J9>K9,1,0)))","v":1},{"$f":"IF(OR(J9=\"\",K9=\"\"),\"\",IF(OR(E9=\"WO\",L9=\"WO\"),\"\",IF(J9=K9,1,0)))","v":0},{"$f":"IF(OR(J9=\"\",K9=\"\"),\"\",IF(OR(E9=\"WO\",L9=\"WO\"),\"\",IF(J9<K9,1,0)))","v":0},{"$f":"IF(OR(J9=\"\",K9=\"\"),\"\",IF(OR(E9=\"WO\",L9=\"WO\"),\"\",J9))","v":9},{"$f":"IF(OR(J9=\"\",K9=\"\"),\"\",IF(OR(E9=\"WO\",L9=\"WO\"),\"\",K9))","v":1},{"$f":"IF(OR(J9=\"\",K9=\"\"),\"\",IF(OR(E9=\"WO\",L9=\"WO\"),\"\",IF(J9<K9,1,0)))","v":0},{"$f":"IF(OR(J9=\"\",K9=\"\"),\"\",IF(OR(E9=\"WO\",L9=\"WO\"),\"\",IF(J9=K9,1,0)))","v":0},{"$f":"IF(OR(J9=\"\",K9=\"\"),\"\",IF(OR(E9=\"WO\",L9=\"WO\"),\"\",IF(J9>K9,1,0)))","v":1},{"$f":"IF(OR(J9=\"\",K9=\"\"),\"\",IF(OR(E9=\"WO\",L9=\"WO\"),\"\",K9))","v":1},{"$f":"IF(OR(J9=\"\",K9=\"\"),\"\",IF(OR(E9=\"WO\",L9=\"WO\"),\"\",J9))","v":9},null,1,{"$f":"RANK(AS9,$AS$9:$AS$24)","v":1},{"$f":"AV9","v":"LEO LIMA (SP)"},{"$f":"SUM(AM9*3)+AN9","v":43},{"$f":"SUM(AM9:AO9)","v":15},{"$f":"SUMIF(E$9:E$142,AJ9,W$9:W$142)+SUMIF(L$9:L$142,AJ9,AB$9:AB$142)","v":14},{"$f":"SUMIF(E$9:E$142,AJ9,X$9:X$142)+SUMIF(L$9:L$142,AJ9,AC$9:AC$142)","v":1},{"$f":"SUMIF(E$9:E$142,AJ9,Y$9:Y$142)+SUMIF(L$9:L$142,AJ9,AD$9:AD$142)","v":0},{"$f":"SUMIF(E$9:E$142,AJ9,Z$9:Z$142)+SUMIF(L$9:L$142,AJ9,AE$9:AE$142)","v":115},{"$f":"SUMIF(E$9:E$142,AJ9,AA$9:AA$142)+SUMIF(L$9:L$142,AJ9,AF$9:AF$142)","v":29},{"$f":"SUM(AP9-AQ9)","v":86},{"$f":"(AK9*1000000000)+((AM9)*1000000)+((AP9-AQ9)*1000)+AP9+AH9/100","v":43014086115.010002},null,1,{"$f":"IFERROR(CONCATENATE(RANKING!$B2,\" (\",RANKING!$D2,\")\"),\"\")","v":"LEO LIMA (SP)"},{"$f":"COUNTIF($E$9:$I$142,$AV9)","v":15},{"$f":"COUNTIF($L$9:$P$142,$AV9)","v":0},null,{"$f":"IF(COUNTIF($E$9:$P$16,$AJ9)=0,\"\",IF(COUNTIF($E$9:$I$16,$AJ9)=1,\"CASA\",\"FORA\"))","v":"CASA"},{"$f":"IF(COUNTIF($E$18:$P$25,$AJ9)=0,\"\",IF(COUNTIF($E$18:$I$25,$AJ9)=1,\"CASA\",\"FORA\"))","v":"CASA"},{"$f":"IF(COUNTIF($E$27:$P$34,$AJ9)=0,\"\",IF(COUNTIF($E$27:$I$34,$AJ9)=1,\"CASA\",\"FORA\"))","v":"CASA"},{"$f":"IF(COUNTIF($E$36:$P$43,$AJ9)=0,\"\",IF(COUNTIF($E$36:$I$43,$AJ9)=1,\"CASA\",\"FORA\"))","v":"CASA"},{"$f":"IF(COUNTIF($E$45:$P$52,$AJ9)=0,\"\",IF(COUNTIF($E$45:$I$52,$AJ9)=1,\"CASA\",\"FORA\"))","v":"CASA"},{"$f":"IF(COUNTIF($E$54:$P$61,$AJ9)=0,\"\",IF(COUNTIF($E$54:$I$61,$AJ9)=1,\"CASA\",\"FORA\"))","v":"CASA"},{"$f":"IF(COUNTIF($E$63:$P$70,$AJ9)=0,\"\",IF(COUNTIF($E$63:$I$70,$AJ9)=1,\"CASA\",\"FORA\"))","v":"CASA"},{"$f":"IF(COUNTIF($E$72:$P$79,$AJ9)=0,\"\",IF(COUNTIF($E$72:$I$79,$AJ9)=1,\"CASA\",\"FORA\"))","v":"CASA"},{"$f":"IF(COUNTIF($E$81:$P$88,$AJ9)=0,\"\",IF(COUNTIF($E$81:$I$88,$AJ9)=1,\"CASA\",\"FORA\"))","v":"CASA"},{"$f":"IF(COUNTIF($E$90:$P$97,$AJ9)=0,\"\",IF(COUNTIF($E$90:$I$97,$AJ9)=1,\"CASA\",\"FORA\"))","v":"CASA"},{"$f":"IF(COUNTIF($E$99:$P$106,$AJ9)=0,\"\",IF(COUNTIF($E$99:$I$106,$AJ9)=1,\"CASA\",\"FORA\"))","v":"CASA"},{"$f":"IF(COUNTIF($E$108:$P$115,$AJ9)=0,\"\",IF(COUNTIF($E$108:$I$115,$AJ9)=1,\"CASA\",\"FORA\"))","v":"CASA"},{"$f":"IF(COUNTIF($E$117:$P$124,$AJ9)=0,\"\",IF(COUNTIF($E$117:$I$124,$AJ9)=1,\"CASA\",\"FORA\"))","v":"CASA"},{"$f":"IF(COUNTIF($E$126:$P$133,$AJ9)=0,\"\",IF(COUNTIF($E$126:$I$133,$AJ9)=1,\"CASA\",\"FORA\"))","v":"CASA"},{"$f":"IF(COUNTIF($E$135:$P$142,$AJ9)=0,\"\",IF(COUNTIF($E$135:$I$142,$AJ9)=1,\"CASA\",\"FORA\"))","v":"CASA"}]
[null,null,null,58,"PEDRO ANTONIO (SP)",null,null,null,null,5,0,"TUGUINHA (SP)",null,null,null,null,null,2,3,null,0,null,1,0,0,5,0,0,0,1,0,5,null,2,{"$f":"RANK(AS10,$AS$9:$AS$24)","v":10},{"$f":"AV10","v":"PEDRO ANTONIO (SP)"},{"$f":"SUM(AM10*3)+AN10","v":18},{"$f":"SUM(AM10:AO10)","v":15},5,3,7,38,45,{"$f":"SUM(AP10-AQ10)","v":-7},{"$f":"(AK10*1000000000)+((AM10)*1000000)+((AP10-AQ10)*1000)+AP10+AH10/100","v":18004993038.02},null,2,{"$f":"IFERROR(CONCATENATE(RANKING!$B3,\" (\",RANKING!$D3,\")\"),\"\")","v":"PEDRO ANTONIO (SP)"},14,1,null,"CASA","CASA","FORA","CASA","CASA","CASA","CASA","CASA","CASA","CASA","CASA","CASA","CASA","CASA","CASA"]
[null,null,null,59,"IGOR COSTA (SP)",null,null,null,null,3,1,"LUIZ GULHERME (SP)",null,null,null,null,null,5,8,null,0,null,1,0,0,3,1,0,0,1,1,3,null,3,11,"TUGUINHA (SP)",17,15,5,2,8,31,54,-23,17004977031.030001,null,3,{"$f":"IFERROR(CONCATENATE(RANKING!$B4,\" (\",RANKING!$D4,\")\"),\"\")","v":"TUGUINHA (SP)"},13,2,null,"FORA","FORA","CASA","CASA","CASA","CASA","CASA","CASA","CASA","CASA","CASA","CASA","CASA","CASA","CASA"]
[null,null,null,60,"VITOR HUGO (SP)",null,null,null,null,0,1,"TUSURINHA (SP)",null,null,null,null,null,6,7,null,0,null,0,0,1,0,1,1,0,0,1,0,null,4,16,"CAROL (SP)",3,15,1,0,14,18,52,-34,3000966018.04,null,4,{"$f":"IFERROR(CONCATENATE(RANKING!$B5,\" (\",RANKING!$D5,\")\"),\"\")","v":"CAROL (SP)"},12,3,null,"FORA","FORA","FORA","CASA","CASA","CASA","CASA","CASA","CASA","CASA","CASA","CASA","CASA","CASA","CASA"]
[1,null,"09:00:00",61,"PEDRINHO (SP)",null,null,null,null,1,2,"MELLI JR (SP)",null,null,null,null,null,9,12,null,0,null,0,0,1,1,2,1,0,0,2,1,null,5,6,"IGOR COSTA (SP)",24,15,8,0,7,39,42,-3,24007997039.049999,null,5,{"$f":"IFERROR(CONCATENATE(RANKING!$B6,\" (\",RANKING!$D6,\")\"),\"\")","v":"IGOR COSTA (SP)"},11,4,null,"CASA","CASA","CASA","FORA","FORA","FORA","FORA","CASA","CASA","CASA","CASA","CASA","CASA","CASA","CASA"]
[1,null,null,62,"WALLACE RINCO (SP)",null,null,null,null,4,0,"DAVI ANDRADE (SP)",null,null,null,null,null,10,11,null,0,null,1,0,0,4,0,0,0,1,0,4,null,6,9,"VITOR HUGO (SP)",19,15,5,4,6,35,41,-6,19004994035.060001,null,6,{"$f":"IFERROR(CONCATENATE(RANKING!$B7,\" (\",RANKING!$D7,\")\"),\"\")","v":"VITOR HUGO (SP)"},10,5,null,"CASA","CASA","FORA","FORA","FORA","FORA","FORA","CASA","CASA","CASA","CASA","CASA","CASA","CASA","CASA"]
[null,null,null,63,"RODRIGO (PE)",null,null,null,null,2,0,"VERISSON (PE)",null,null,null,null,null,13,16,null,0,null,1,0,0,2,0,0,0,1,0,2,null,7,7,"TUSURINHA (SP)",21,15,7,0,8,31,49,-18,21006982031.07,null,7,{"$f":"IFERROR(CONCATENATE(RANKING!$B8,\" (\",RANKING!$D8,\")\"),\"\")","v":"TUSURINHA (SP)"},9,6,null,"FORA","FORA","CASA","FORA","FORA","FORA","FORA","CASA","CASA","CASA","CASA","CASA","CASA","CASA","CASA"]
[null,null,null,64,"LINNO BALA (PE)",null,null,null,null,2,4,"DANIEL COUTO (RJ)",null,null,null,null,null,14,15,null,0,null,0,0,1,2,4,1,0,0,4,2,null,8,8,"LUIZ GULHERME (SP)",20,15,6,2,7,40,43,-3,20005997040.080002,null,8,{"$f":"IFERROR(CONCATENATE(RANKING!$B9,\" (\",RANKING!$D9,\")\"),\"\")","v":"LUIZ GULHERME (SP)"},8,7,null,"FORA","FORA","FORA","FORA","FORA","FORA","FORA","CASA","CASA","CASA","CASA","CASA","CASA","CASA","CASA"]
[1,null,null,null,null,null,null,null,null,null,null,null,null,null,null,null,null,null,null,null,null,null,"","","","","","","","","","",null,9,13,"PEDRINHO (SP)",14,15,3,5,7,31,40,-9,14002991031.09,null,9,{"$f":"IFERROR(CONCATENATE(RANKING!$B10,\" (\",RANKING!$D10,\")\"),\"\")","v":"PEDRINHO (SP)"},7,8,null,"CASA","CASA","CASA","CASA","CASA","CASA","CASA","FORA","FORA","FORA","FORA","FORA","FORA","FORA","FORA"]
[1,2,{"$f":"$C$9","v":"2022-06-17"},60,{"$f":"VLOOKUP($R18,$AU$9:$AV$24,2,0)","v":"LEO LIMA (SP)"},null,null,null,null,8,1,{"$f":"VLOOKUP($S18,$AU$9:$AV$24,2,0)","v":"TUGUINHA (SP)"},null,null,null,null,null,1,3,null,{"$f":"COUNTBLANK(J18:K18)","v":0},null,1,0,0,8,1,0,0,1,1,8,null,10,3,"WALLACE RINCO (SP)",40,15,13,1,1,77,36,41,40013041077.099998,null,10,{"$f":"IFERROR(CONCATENATE(RANKING!$B11,\" (\",RANKING!$D11,\")\"),\"\")","v":"WALLACE RINCO (SP)"},6,9,null,"CASA","CASA","FORA","CASA","CASA","CASA","CASA","FORA","FORA","FORA","FORA","FORA","FORA","FORA","FORA"]
[null,null,null,59,"PEDRO ANTONIO (SP)",null,null,null,null,1,0,"CAROL (SP)",null,null,null,null,null,2,4,null,0,null,1,0,0,1,0,0,0,1,0,1,null,11,15,"DAVI ANDRADE (SP)",7,15,2,1,12,14,43,-29,7001971014.1099997,null,11,{"$f":"IFERROR(CONCATENATE(RANKING!$B12,\" (\",RANKING!$D12,\")\"),\"\")","v":"DAVI ANDRADE (SP)"},5,10,null,"FORA","FORA","CASA","CASA","CASA","CASA","CASA","FORA","FORA","FORA","FORA","FORA","FORA","FORA","FORA"]
[null,null,null,62,"IGOR COSTA (SP)",null,null,null,null,1,2,"TUSURINHA (SP)",null,null,null,null,null,5,7,null,0,null,0,0,1,1,2,1,0,0,2,1,null,12,5,"MELLI JR (SP)",28,15,9,1,5,44,46,-2,28008998044.119999,null,12,{"$f":"IFERROR(CONCATENATE(RANKING!$B13,\" (\",RANKING!$D13,\")\"),\"\")","v":"MELLI JR (SP)"},4,11,null,"FORA","FORA","FORA","CASA","CASA","CASA","CASA","FORA","FORA","FORA","FORA","FORA","FORA","FORA","FORA"]
[null,null,null,61,"VITOR HUGO (SP)",null,null,null,null,3,2,"LUIZ GULHERME (SP)",null,null,null,null,null,6,8,null,0,null,1,0,0,3,2,0,0,1,2,3,null,13,4,"RODRIGO (PE)",28,15,9,1,5,59,48,11,28009011059.130001,null,13,{"$f":"IFERROR(CONCATENATE(RANKING!$B14,\" (\",RANKING!$D14,\")\"),\"\")","v":"RODRIGO (PE)"},3,12,null,"CASA","CASA","CASA","FORA","FORA","FORA","FORA","FORA","FORA","FORA","FORA","FORA","FORA","FORA","FORA"]
[1,null,"09:30:00",63,"PEDRINHO (SP)",null,null,null,null,1,2,"DAVI ANDRADE (SP)",null,null,null,null,null,9,11,null,0,null,0,0,1,1,2,1,0,0,2,1,null,14,12,"LINNO BALA (PE)",15,15,4,3,8,31,52,-21,15003979031.139999,null,14,{"$f":"IFERROR(CONCATENATE(RANKING!$B15,\" (\",RANKING!$D15,\")\"),\"\")","v":"LINNO BALA (PE)"},2,13,null,"CASA","CASA","FORA","FORA","FORA","FORA","FORA","FORA","FORA","FORA","FORA","FORA","FORA","FORA","FORA"]
[1,null,null,64,"WALLACE RINCO (SP)",null,null,null,null,6,0,"MELLI JR (SP)",null,null,null,null,null,10,12,null,0,null,1,0,0,6,0,0,0,1,0,6,null,15,2,"DANIEL COUTO (RJ)",40,15,13,1,1,79,34,45,40013045079.150002,null,15,{"$f":"IFERROR(CONCATENATE(RANKING!$B16,\" (\",RANKING!$D16,\")\"),\"\")","v":"DANIEL COUTO (RJ)"},1,14,null,"FORA","FORA","CASA","FORA","FORA","FORA","FORA","FORA","FORA","FORA","FORA","FORA","FORA","FORA","FORA"]
[null,null,null,57,"RODRIGO (PE)",null,null,null,null,2,6,"DANIEL COUTO (RJ)",null,null,null,null,null,13,15,null,0,null,0,0,1,2,6,1,0,0,6,2,null,16,14,"VERISSON (PE)",10,15,3,1,11,22,50,-28,10002972022.16,null,16,{"$f":"IFERROR(CONCATENATE(RANKING!$B17,\" (\",RANKING!$D17,\")\"),\"\")","v":"VERISSON (PE)"},0,15,null,"FORA","FORA","FORA","FORA","FORA","FORA","FORA","FORA","FORA","FORA","FORA","FORA","FORA","FORA","FORA"]
[null,null,null,58,"LINNO BALA (PE)",null,null,null,null,0,2,"VERISSON (PE)",null,null,null,null,null,14,16,null,0,null,0,0,1,0,2,1,0,0,2,0]
[1,null,null,null,null,null,null,null,null,null,null,null,null,null,null,null,null,null,null,null,null,null,"","","","","","","","","",""]
[1,3,{"$f":"$C$9","v":"2022-06-17"},62,{"$f":"VLOOKUP($R27,$AU$9:$AV$24,2,0)","v":"LEO LIMA (SP)"},null,null,null,null,7,3,{"$f":"VLOOKUP($S27,$AU$9:$AV$24,2,0)","v":"PEDRO ANTONIO (SP)"},null,null,null,null,null,1,2,null,{"$f":"COUNTBLANK(J27:K27)","v":0},null,1,0,0,7,3,0,0,1,3,7]
[null,null,null,63,"TUGUINHA (SP)",null,null,null,null,2,1,"CAROL (SP)",null,null,null,null,null,3,4,null,0,null,1,0,0,2,1,0,0,1,1,2]
[null,null,null,64,"IGOR COSTA (SP)",null,null,null,null,3,1,"VITOR HUGO (SP)",null,null,null,null,null,5,6,null,0,null,1,0,0,3,1,0,0,1,1,3]
[null,null,null,57,"TUSURINHA (SP)",null,null,null,null,3,5,"LUIZ GULHERME (SP)",null,null,null,null,null,7,8,null,0,null,0,0,1,3,5,1,0,0,5,3]
[1,null,"10:00:00",59,"PEDRINHO (SP)",null,null,null,null,2,4,"WALLACE RINCO (SP)",null,null,null,null,null,9,10,null,0,null,0,0,1,2,4,1,0,0,4,2]
[1,null,null,58,"DAVI ANDRADE (SP)",null,null,null,null,2,4,"MELLI JR (SP)",null,null,null,null,null,11,12,null,0,null,0,0,1,2,4,1,0,0,4,2]
[null,null,null,60,"RODRIGO (PE)",null,null,null,null,2,1,"LINNO BALA (PE)",null,null,null,null,null,13,14,null,0,null,1,0,0,2,1,0,0,1,1,2]
[null,null,null,61,"DANIEL COUTO (RJ)",null,null,null,null,7,1,"VERISSON (PE)",null,null,null,null,null,15,16,null,0,null,1,0,0,7,1,0,0,1,1,7]
[1,null,null,null,null,null,null,null,null,null,null,null,null,null,null,null,null,null,null,null,null,null,"","","","","","","","","",""]
[1,4,{"$f":"$C$9","v":"2022-06-17"},58,{"$f":"VLOOKUP($R36,$AU$9:$AV$24,2,0)","v":"LEO LIMA (SP)"},null,null,null,null,8,2,{"$f":"VLOOKUP($S36,$AU$9:$AV$24,2,0)","v":"IGOR COSTA (SP)"},null,null,null,null,null,1,5,null,{"$f":"COUNTBLANK(J36:K36)","v":0},null,1,0,0,8,2,0,0,1,2,8]
[null,null,null,57,"PEDRO ANTONIO (SP)",null,null,null,null,3,3,"VITOR HUGO (SP)",null,null,null,null,null,2,6,null,0,null,0,1,0,3,3,0,1,0,3,3]
[null,null,null,59,"TUGUINHA (SP)",null,null,null,null,1,4,"TUSURINHA (SP)",null,null,null,null,null,3,7,null,0,null,0,0,1,1,4,1,0,0,4,1]
[null,null,null,60,"CAROL (SP)",null,null,null,null,2,3,"LUIZ GULHERME (SP)",null,null,null,null,null,4,8,null,0,null,0,0,1,2,3,1,0,0,3,2]
[1,null,"10:30:00",62,"PEDRINHO (SP)",null,null,null,null,3,3,"RODRIGO (PE)",null,null,null,null,null,9,13,null,0,null,0,1,0,3,3,0,1,0,3,3]
[1,null,null,61,"WALLACE RINCO (SP)",null,null,null,null,9,3,"LINNO BALA (PE)",null,null,null,null,null,10,14,null,0,null,{"$f":"IF(OR(J41=\"\",K41=\"\"),\"\",IF(OR(E41=\"WO\",L41=\"WO\"),\"\",IF(J41>K41,1,0)))","v":1},{"$f":"IF(OR(J41=\"\",K41=\"\"),\"\",IF(OR(E41=\"WO\",L41=\"WO\"),\"\",IF(J41=K41,1,0)))","v":0},{"$f":"IF(OR(J41=\"\",K41=\"\"),\"\",IF(OR(E41=\"WO\",L41=\"WO\"),\"\",IF(J41<K41,1,0)))","v":0},{"$f":"IF(OR(J41=\"\",K41=\"\"),\"\",IF(OR(E41=\"WO\",L41=\"WO\"),\"\",J41))","v":9},{"$f":"IF(OR(J41=\"\",K41=\"\"),\"\",IF(OR(E41=\"WO\",L41=\"WO\"),\"\",K41))","v":3},{"$f":"IF(OR(J41=\"\",K41=\"\"),\"\",IF(OR(E41=\"WO\",L41=\"WO\"),\"\",IF(J41<K41,1,0)))","v":0},{"$f":"IF(OR(J41=\"\",K41=\"\"),\"\",IF(OR(E41=\"WO\",L41=\"WO\"),\"\",IF(J41=K41,1,0)))","v":0},{"$f":"IF(OR(J41=\"\",K41=\"\"),\"\",IF(OR(E41=\"WO\",L41=\"WO\"),\"\",IF(J41>K41,1,0)))","v":1},{"$f":"IF(OR(J41=\"\",K41=\"\"),\"\",IF(OR(E41=\"WO\",L41=\"WO\"),\"\",K41))","v":3},{"$f":"IF(OR(J41=\"\",K41=\"\"),\"\",IF(OR(E41=\"WO\",L41=\"WO\"),\"\",J41))","v":9}]
[null,null,null,64,"DAVI ANDRADE (SP)",null,null,null,null,0,3,"DANIEL COUTO (RJ)",null,null,null,null,null,11,15,null,0,null,0,0,1,0,3,1,0,0,3,0]
[null,null,null,63,"MELLI JR (SP)",null,null,null,null,3,2,"VERISSON (PE)",null,null,null,null,null,12,16,null,0,null,1,0,0,3,2,0,0,1,2,3]
[1,null,null,null,null,null,null,null,null,null,null,null,null,null,null,null,null,null,null,null,null,null,"","","","","","","","","",""]
[1,5,{"$f":"$C$9","v":"2022-06-17"},60,{"$f":"VLOOKUP($R45,$AU$9:$AV$24,2,0)","v":"LEO LIMA (SP)"},null,null,null,null,7,1,{"$f":"VLOOKUP($S45,$AU$9:$AV$24,2,0)","v":"VITOR HUGO (SP)"},null,null,null,null,null,1,6,null,{"$f":"COUNTBLANK(J45:K45)","v":0},null,1,0,0,7,1,0,0,1,1,7]
[null,null,null,61,"PEDRO ANTONIO (SP)",null,null,null,null,3,2,"TUSURINHA (SP)",null,null,null,null,null,2,7,null,0,null,1,0,0,3,2,0,0,1,2,3]
[null,null,null,62,"TUGUINHA (SP)",null,null,null,null,0,2,"LUIZ GULHERME (SP)",null,null,null,null,null,3,8,null,0,null,0,0,1,0,2,1,0,0,2,0]
[null,null,null,63,"CAROL (SP)",null,null,null,null,1,2,"IGOR COSTA (SP)",null,null,null,null,null,4,5,null,0,null,0,0,1,1,2,1,0,0,2,1]
[1,null,"11:00:00",64,"PEDRINHO (SP)",null,null,null,null,1,3,"LINNO BALA (PE)",null,null,null,null,null,9,14,null,0,null,0,0,1,1,3,1,0,0,3,1]
[1,null,null,58,"WALLACE RINCO (SP)",null,null,null,null,4,4,"DANIEL COUTO (RJ)",null,null,null,null,null,10,15,null,0,null,0,1,0,4,4,0,1,0,4,4]
[null,null,null,57,"DAVI ANDRADE (SP)",null,null,null,null,3,1,"VERISSON (PE)",null,null,null,null,null,11,16,null,0,null,1,0,0,3,1,0,0,1,1,3]
[null,null,null,59,"MELLI JR (SP)",null,null,null,null,5,3,"RODRIGO (PE)",null,null,null,null,null,12,13,null,0,null,1,0,0,5,3,0,0,1,3,5]
[1,null,null,null,null,null,null,null,null,null,null,null,null,null,null,null,null,null,null,null,null,null,"","","","","","","","","",""]
[1,6,{"$f":"$C$9","v":"2022-06-17"},62,{"$f":"VLOOKUP($R54,$AU$9:$AV$24,2,0)","v":"LEO LIMA (SP)"},null,null,null,null,10,0,{"$f":"VLOOKUP($S54,$AU$9:$AV$24,2,0)","v":"TUSURINHA (SP)"},null,null,null,null,null,1,7,null,{"$f":"COUNTBLANK(J54:K54)","v":0},null,1,0,0,10,0,0,0,1,0,10]
[null,null,null,64,"PEDRO ANTONIO (SP)",null,null,null,null,1,4,"LUIZ GULHERME (SP)",null,null,null,null,null,2,8,null,0,null,0,0,1,1,4,1,0,0,4,1]
[null,null,null,57,"TUGUINHA (SP)",null,null,null,null,3,1,"IGOR COSTA (SP)",null,null,null,null,null,3,5,null,0,null,1,0,0,3,1,0,0,1,1,3]
[null,null,null,58,"CAROL (SP)",null,null,null,null,1,3,"VITOR HUGO (SP)",null,null,null,null,null,4,6,null,0,null,0,0,1,1,3,1,0,0,3,1]
[1,null,"11:30:00",60,"PEDRINHO (SP)",null,null,null,null,3,6,"DANIEL COUTO (RJ)",null,null,null,null,null,9,15,null,0,null,0,0,1,3,6,1,0,0,6,3]
[1,null,null,59,"WALLACE RINCO (SP)",null,null,null,null,4,1,"VERISSON (PE)",null,null,null,null,null,10,16,null,0,null,1,0,0,4,1,0,0,1,1,4]
[null,null,null,61,"DAVI ANDRADE (SP)",null,null,null,null,0,4,"RODRIGO (PE)",null,null,null,null,null,11,13,null,0,null,0,0,1,0,4,1,0,0,4,0]
[null,null,null,63,"MELLI JR (SP)",null,null,null,null,5,2,"LINNO BALA (PE)",null,null,null,null,null,12,14,null,0,null,1,0,0,5,2,0,0,1,2,5]
[1,null,null,null,null,null,null,null,null,null,null,null,null,null,null,null,null,null,null,null,null,null,"","","","","","","","","",""]
[1,7,{"$f":"$C$9","v":"2022-06-17"},58,{"$f":"VLOOKUP($R63,$AU$9:$AV$24,2,0)","v":"LEO LIMA (SP)"},null,null,null,null,8,3,{"$f":"VLOOKUP($S63,$AU$9:$AV$24,2,0)","v":"LUIZ GULHERME (SP)"},null,null,null,null,null,1,8,null,{"$f":"COUNTBLANK(J63:K63)","v":0},null,1,0,0,8,3,0,0,1,3,8]
[null,null,null,59,"PEDRO ANTONIO (SP)",null,null,null,null,2,3,"IGOR COSTA (SP)",null,null,null,null,null,2,5,null,0,null,0,0,1,2,3,1,0,0,3,2]
[null,null,null,64,"TUGUINHA (SP)",null,null,null,null,0,4,"VITOR HUGO (SP)",null,null,null,null,null,3,6,null,0,null,0,0,1,0,4,1,0,0,4,0]
[null,null,null,61,"CAROL (SP)",null,null,null,null,1,4,"TUSURINHA (SP)",null,null,null,null,null,4,7,null,0,null,0,0,1,1,4,1,0,0,4,1]
[1,null,"12:00:00",57,"PEDRINHO (SP)",null,null,null,null,1,0,"VERISSON (PE)",null,null,null,null,null,9,16,null,0,null,1,0,0,1,0,0,0,1,0,1]
[1,null,null,63,"WALLACE RINCO (SP)",null,null,null,null,8,5,"RODRIGO (PE)",null,null,null,null,null,10,13,null,0,null,1,0,0,8,5,0,0,1,5,8]
[null,null,null,60,"DAVI ANDRADE (SP)",null,null,null,null,1,2,"LINNO BALA (PE)",null,null,null,null,null,11,14,null,0,null,0,0,1,1,2,1,0,0,2,1]
[null,null,null,62,"MELLI JR (SP)",null,null,null,null,3,5,"DANIEL COUTO (RJ)",null,null,null,null,null,12,15,null,0,null,0,0,1,3,5,1,0,0,5,3]
[1,null,null,null,null,null,null,null,null,null,null,null,null,null,null,null,null,null,null,null,null,null,"","","","","","","","","",""]
[1,8,{"$f":"$C$9","v":"2022-06-17"},61,{"$f":"VLOOKUP($R72,$AU$9:$AV$24,2,0)","v":"LEO LIMA (SP)"},null,null,null,null,3,3,{"$f":"VLOOKUP($S72,$AU$9:$AV$24,2,0)","v":"PEDRINHO (SP)"},null,null,null,null,null,1,9,null,{"$f":"COUNTBLANK(J72:K72)","v":0},null,0,1,0,3,3,0,1,0,3,3]
[null,null,null,62,"PEDRO ANTONIO (SP)",null,null,null,null,2,3,"WALLACE RINCO (SP)",null,null,null,null,null,2,10,null,0,null,{"$f":"IF(OR(J73=\"\",K73=\"\"),\"\",IF(OR(E73=\"WO\",L73=\"WO\"),\"\",IF(J73>K73,1,0)))","v":0},{"$f":"IF(OR(J73=\"\",K73=\"\"),\"\",IF(OR(E73=\"WO\",L73=\"WO\"),\"\",IF(J73=K73,1,0)))","v":0},{"$f":"IF(OR(J73=\"\",K73=\"\"),\"\",IF(OR(E73=\"WO\",L73=\"WO\"),\"\",IF(J73<K73,1,0)))","v":1},{"$f":"IF(OR(J73=\"\",K73=\"\"),\"\",IF(OR(E73=\"WO\",L73=\"WO\"),\"\",J73))","v":2},{"$f":"IF(OR(J73=\"\",K73=\"\"),\"\",IF(OR(E73=\"WO\",L73=\"WO\"),\"\",K73))","v":3},{"$f":"IF(OR(J73=\"\",K73=\"\"),\"\",IF(OR(E73=\"WO\",L73=\"WO\"),\"\",IF(J73<K73,1,0)))","v":1},{"$f":"IF(OR(J73=\"\",K73=\"\"),\"\",IF(OR(E73=\"WO\",L73=\"WO\"),\"\",IF(J73=K73,1,0)))","v":0},{"$f":"IF(OR(J73=\"\",K73=\"\"),\"\",IF(OR(E73=\"WO\",L73=\"WO\"),\"\",IF(J73>K73,1,0)))","v":0},{"$f":"IF(OR(J73=\"\",K73=\"\"),\"\",IF(OR(E73=\"WO\",L73=\"WO\"),\"\",K73))","v":3},{"$f":"IF(OR(J73=\"\",K73=\"\"),\"\",IF(OR(E73=\"WO\",L73=\"WO\"),\"\",J73))","v":2}]
[null,null,null,63,"TUGUINHA (SP)",null,null,null,null,2,1,"DAVI ANDRADE (SP)",null,null,null,null,null,3,11,null,0,null,1,0,0,2,1,0,0,1,1,2]
[null,null,null,64,"CAROL (SP)",null,null,null,null,2,3,"MELLI JR (SP)",null,null,null,null,null,4,12,null,0,null,0,0,1,2,3,1,0,0,3,2]
[1,null,"12:30:00",57,"IGOR COSTA (SP)",null,null,null,null,2,5,"RODRIGO (PE)",null,null,null,null,null,5,13,null,0,null,0,0,1,2,5,1,0,0,5,2]
[1,null,null,58,"VITOR HUGO (SP)",null,null,null,null,2,2,"LINNO BALA (PE)",null,null,null,null,null,6,14,null,0,null,0,1,0,2,2,0,1,0,2,2]
[null,null,null,59,"TUSURINHA (SP)",null,null,null,null,0,6,"DANIEL COUTO (RJ)",null,null,null,null,null,7,15,null,0,null,0,0,1,0,6,1,0,0,6,0]
[null,null,null,60,"LUIZ GULHERME (SP)",null,null,null,null,1,1,"VERISSON (PE)",null,null,null,null,null,8,16,null,0,null,0,1,0,1,1,0,1,0,1,1]
[1,null,null,null,null,null,null,null,null,null,null,null,null,null,null,null,null,null,null,null,null,null,"","","","","","","","","",""]
[1,9,"2022-06-18",57,{"$f":"VLOOKUP($R81,$AU$9:$AV$24,2,0)","v":"LEO LIMA (SP)"},null,null,null,null,7,3,{"$f":"VLOOKUP($S81,$AU$9:$AV$24,2,0)","v":"WALLACE RINCO (SP)"},null,null,null,null,null,1,10,null,{"$f":"COUNTBLANK(J81:K81)","v":0},null,1,0,0,7,3,0,0,1,3,7]
[null,null,null,58,"PEDRO ANTONIO (SP)",null,null,null,null,2,0,"DAVI ANDRADE (SP)",null,null,null,null,null,2,11,null,0,null,1,0,0,2,0,0,0,1,0,2]
[null,null,null,59,"TUGUINHA (SP)",null,null,null,null,2,2,"MELLI JR (SP)",null,null,null,null,null,3,12,null,0,null,0,1,0,2,2,0,1,0,2,2]
[null,null,null,60,"CAROL (SP)",null,null,null,null,1,4,"RODRIGO (PE)",null,null,null,null,null,4,13,null,0,null,0,0,1,1,4,1,0,0,4,1]
[1,null,"09:00:00",61,"IGOR COSTA (SP)",null,null,null,null,4,1,"LINNO BALA (PE)",null,null,null,null,null,5,14,null,0,null,1,0,0,4,1,0,0,1,1,4]
[1,null,null,62,"VITOR HUGO (SP)",null,null,null,null,3,6,"DANIEL COUTO (RJ)",null,null,null,null,null,6,15,null,0,null,0,0,1,3,6,1,0,0,6,3]
[null,null,null,63,"TUSURINHA (SP)",null,null,null,null,4,1,"VERISSON (PE)",null,null,null,null,null,7,16,null,0,null,1,0,0,4,1,0,0,1,1,4]
[null,null,null,64,"LUIZ GULHERME (SP)",null,null,null,null,2,2,"PEDRINHO (SP)",null,null,null,null,null,8,9,null,0,null,0,1,0,2,2,0,1,0,2,2]
[1,null,null,null,null,null,null,null,null,null,null,null,null,null,null,null,null,null,null,null,null,null,"","","","","","","","","",""]
[1,10,{"$f":"$C$81","v":"2022-06-18"},59,{"$f":"VLOOKUP($R90,$AU$9:$AV$24,2,0)","v":"LEO LIMA (SP)"},null,null,null,null,9,1,{"$f":"VLOOKUP($S90,$AU$9:$AV$24,2,0)","v":"DAVI ANDRADE (SP)"},null,null,null,null,null,1,11,null,{"$f":"COUNTBLANK(J90:K90)","v":0},null,1,0,0,9,1,0,0,1,1,9]
[null,null,null,60,"PEDRO ANTONIO (SP)",null,null,null,null,1,4,"MELLI JR (SP)",null,null,null,null,null,2,12,null,0,null,0,0,1,1,4,1,0,0,4,1]
[null,null,null,58,"TUGUINHA (SP)",null,null,null,null,3,5,"RODRIGO (PE)",null,null,null,null,null,3,13,null,0,null,0,0,1,3,5,1,0,0,5,3]
[null,null,null,62,"CAROL (SP)",null,null,null,null,1,3,"LINNO BALA (PE)",null,null,null,null,null,4,14,null,0,null,0,0,1,1,3,1,0,0,3,1]
[1,null,"09:30:00",63,"IGOR COSTA (SP)",null,null,null,null,3,6,"DANIEL COUTO (RJ)",null,null,null,null,null,5,15,null,0,null,0,0,1,3,6,1,0,0,6,3]
[1,null,null,64,"VITOR HUGO (SP)",null,null,null,null,1,3,"VERISSON (PE)",null,null,null,null,null,6,16,null,0,null,0,0,1,1,3,1,0,0,3,1]
[null,null,null,57,"TUSURINHA (SP)",null,null,null,null,2,3,"PEDRINHO (SP)",null,null,null,null,null,7,9,null,0,null,0,0,1,2,3,1,0,0,3,2]
[null,null,null,61,"LUIZ GULHERME (SP)",null,null,null,null,3,5,"WALLACE RINCO (SP)",null,null,null,null,null,8,10,null,0,null,0,0,1,3,5,1,0,0,5,3]
[1,null,null,null,null,null,null,null,null,null,null,null,null,null,null,null,null,null,null,null,null,null,"","","","","","","","","",""]
[1,11,{"$f":"$C$81","v":"2022-06-18"},62,{"$f":"VLOOKUP($R99,$AU$9:$AV$24,2,0)","v":"LEO LIMA (SP)"},null,null,null,null,8,2,{"$f":"VLOOKUP($S99,$AU$9:$AV$24,2,0)","v":"MELLI JR (SP)"},null,null,null,null,null,1,12,null,{"$f":"COUNTBLANK(J99:K99)","v":0},null,1,0,0,8,2,0,0,1,2,8]
[null,null,null,63,"PEDRO ANTONIO (SP)",null,null,null,null,2,6,"RODRIGO (PE)",null,null,null,null,null,2,13,null,0,null,0,0,1,2,6,1,0,0,6,2]
[null,null,null,61,"TUGUINHA (SP)",null,null,null,null,3,3,"LINNO BALA (PE)",null,null,null,null,null,3,14,null,0,null,0,1,0,3,3,0,1,0,3,3]
[null,null,null,57,"CAROL (SP)",null,null,null,null,2,5,"DANIEL COUTO (RJ)",null,null,null,null,null,4,15,null,0,null,0,0,1,2,5,1,0,0,5,2]
[1,null,"10:00:00",58,"IGOR COSTA (SP)",null,null,null,null,2,1,"VERISSON (PE)",null,null,null,null,null,5,16,null,0,null,1,0,0,2,1,0,0,1,1,2]
[1,null,null,59,"VITOR HUGO (SP)",null,null,null,null,2,2,"PEDRINHO (SP)",null,null,null,null,null,6,9,null,0,null,0,1,0,2,2,0,1,0,2,2]
[null,null,null,60,"TUSURINHA (SP)",null,null,null,null,1,5,"WALLACE RINCO (SP)",null,null,null,null,null,7,10,null,0,null,{"$f":"IF(OR(J105=\"\",K105=\"\"),\"\",IF(OR(E105=\"WO\",L105=\"WO\"),\"\",IF(J105>K105,1,0)))","v":0},{"$f":"IF(OR(J105=\"\",K105=\"\"),\"\",IF(OR(E105=\"WO\",L105=\"WO\"),\"\",IF(J105=K105,1,0)))","v":0},{"$f":"IF(OR(J105=\"\",K105=\"\"),\"\",IF(OR(E105=\"WO\",L105=\"WO\"),\"\",IF(J105<K105,1,0)))","v":1},{"$f":"IF(OR(J105=\"\",K105=\"\"),\"\",IF(OR(E105=\"WO\",L105=\"WO\"),\"\",J105))","v":1},{"$f":"IF(OR(J105=\"\",K105=\"\"),\"\",IF(OR(E105=\"WO\",L105=\"WO\"),\"\",K105))","v":5},{"$f":"IF(OR(J105=\"\",K105=\"\"),\"\",IF(OR(E105=\"WO\",L105=\"WO\"),\"\",IF(J105<K105,1,0)))","v":1},{"$f":"IF(OR(J105=\"\",K105=\"\"),\"\",IF(OR(E105=\"WO\",L105=\"WO\"),\"\",IF(J105=K105,1,0)))","v":0},{"$f":"IF(OR(J105=\"\",K105=\"\"),\"\",IF(OR(E105=\"WO\",L105=\"WO\"),\"\",IF(J105>K105,1,0)))","v":0},{"$f":"IF(OR(J105=\"\",K105=\"\"),\"\",IF(OR(E105=\"WO\",L105=\"WO\"),\"\",K105))","v":5},{"$f":"IF(OR(J105=\"\",K105=\"\"),\"\",IF(OR(E105=\"WO\",L105=\"WO\"),\"\",J105))","v":1}]
[null,null,null,64,"LUIZ GULHERME (SP)",null,null,null,null,2,0,"DAVI ANDRADE (SP)",null,null,null,null,null,8,11,null,0,null,1,0,0,2,0,0,0,1,0,2]
[1,null,null,null,null,null,null,null,null,null,null,null,null,null,null,null,null,null,null,null,null,null,"","","","","","","","","",""]
[1,12,{"$f":"$C$81","v":"2022-06-18"},64,{"$f":"VLOOKUP($R108,$AU$9:$AV$24,2,0)","v":"LEO LIMA (SP)"},null,null,null,null,8,4,{"$f":"VLOOKUP($S108,$AU$9:$AV$24,2,0)","v":"RODRIGO (PE)"},null,null,null,null,null,1,13,null,{"$f":"COUNTBLANK(J108:K108)","v":0},null,1,0,0,8,4,0,0,1,4,8]
[null,null,null,58,"PEDRO ANTONIO (SP)",null,null,null,null,3,3,"LINNO BALA (PE)",null,null,null,null,null,2,14,null,0,null,0,1,0,3,3,0,1,0,3,3]
[null,null,null,59,"TUGUINHA (SP)",null,null,null,null,3,6,"DANIEL COUTO (RJ)",null,null,null,null,null,3,15,null,0,null,0,0,1,3,6,1,0,0,6,3]
[null,null,null,60,"CAROL (SP)",null,null,null,null,2,5,"VERISSON (PE)",null,null,null,null,null,4,16,null,0,null,0,0,1,2,5,1,0,0,5,2]
[1,null,"10:30:00",62,"IGOR COSTA (SP)",null,null,null,null,4,1,"PEDRINHO (SP)",null,null,null,null,null,5,9,null,0,null,1,0,0,4,1,0,0,1,1,4]
[1,null,null,61,"VITOR HUGO (SP)",null,null,null,null,2,5,"WALLACE RINCO (SP)",null,null,null,null,null,6,10,null,0,null,0,0,1,2,5,1,0,0,5,2]
[null,null,null,63,"TUSURINHA (SP)",null,null,null,null,1,0,"DAVI ANDRADE (SP)",null,null,null,null,null,7,11,null,0,null,1,0,0,1,0,0,0,1,0,1]
[null,null,null,57,"LUIZ GULHERME (SP)",null,null,null,null,3,4,"MELLI JR (SP)",null,null,null,null,null,8,12,null,0,null,0,0,1,3,4,1,0,0,4,3]
[1,null,null,null,null,null,null,null,null,null,null,null,null,null,null,null,null,null,null,null,null,null,"","","","","","","","","",""]
[1,13,{"$f":"$C$81","v":"2022-06-18"},60,{"$f":"VLOOKUP($R117,$AU$9:$AV$24,2,0)","v":"LEO LIMA (SP)"},null,null,null,null,10,2,{"$f":"VLOOKUP($S117,$AU$9:$AV$24,2,0)","v":"LINNO BALA (PE)"},null,null,null,null,null,1,14,null,{"$f":"COUNTBLANK(J117:K117)","v":0},null,1,0,0,10,2,0,0,1,2,10]
[null,null,null,61,"PEDRO ANTONIO (SP)",null,null,null,null,2,7,"DANIEL COUTO (RJ)",null,null,null,null,null,2,15,null,0,null,0,0,1,2,7,1,0,0,7,2]
[null,null,null,62,"TUGUINHA (SP)",null,null,null,null,4,2,"VERISSON (PE)",null,null,null,null,null,3,16,null,0,null,1,0,0,4,2,0,0,1,2,4]
[null,null,null,63,"CAROL (SP)",null,null,null,null,1,3,"PEDRINHO (SP)",null,null,null,null,null,4,9,null,0,null,0,0,1,1,3,1,0,0,3,1]
[1,null,"11:00:00",64,"IGOR COSTA (SP)",null,null,null,null,2,5,"WALLACE RINCO (SP)",null,null,null,null,null,5,10,null,0,null,0,0,1,2,5,1,0,0,5,2]
[1,null,null,57,"VITOR HUGO (SP)",null,null,null,null,2,2,"DAVI ANDRADE (SP)",null,null,null,null,null,6,11,null,0,null,0,1,0,2,2,0,1,0,2,2]
[null,null,null,58,"TUSURINHA (SP)",null,null,null,null,3,2,"MELLI JR (SP)",null,null,null,null,null,7,12,null,0,null,1,0,0,3,2,0,0,1,2,3]
[null,null,null,59,"LUIZ GULHERME (SP)",null,null,null,null,3,4,"RODRIGO (PE)",null,null,null,null,null,8,13,null,0,null,0,0,1,3,4,1,0,0,4,3]
[1,null,null,null,null,null,null,null,null,null,null,null,null,null,null,null,null,null,null,null,null,null,"","","","","","","","","",""]
[1,14,{"$f":"$C$81","v":"2022-06-18"},63,{"$f":"VLOOKUP($R126,$AU$9:$AV$24,2,0)","v":"LEO LIMA (SP)"},null,null,null,null,3,2,{"$f":"VLOOKUP($S126,$AU$9:$AV$24,2,0)","v":"DANIEL COUTO (RJ)"},null,null,null,null,null,1,15,null,{"$f":"COUNTBLANK(J126:K126)","v":0},null,1,0,0,3,2,0,0,1,2,3]
[null,null,null,64,"PEDRO ANTONIO (SP)",null,null,null,null,6,1,"VERISSON (PE)",null,null,null,null,null,2,16,null,0,null,{"$f":"IF(OR(J127=\"\",K127=\"\"),\"\",IF(OR(E127=\"WO\",L127=\"WO\"),\"\",IF(J127>K127,1,0)))","v":1},{"$f":"IF(OR(J127=\"\",K127=\"\"),\"\",IF(OR(E127=\"WO\",L127=\"WO\"),\"\",IF(J127=K127,1,0)))","v":0},{"$f":"IF(OR(J127=\"\",K127=\"\"),\"\",IF(OR(E127=\"WO\",L127=\"WO\"),\"\",IF(J127<K127,1,0)))","v":0},{"$f":"IF(OR(J127=\"\",K127=\"\"),\"\",IF(OR(E127=\"WO\",L127=\"WO\"),\"\",J127))","v":6},{"$f":"IF(OR(J127=\"\",K127=\"\"),\"\",IF(OR(E127=\"WO\",L127=\"WO\"),\"\",K127))","v":1},{"$f":"IF(OR(J127=\"\",K127=\"\"),\"\",IF(OR(E127=\"WO\",L127=\"WO\"),\"\",IF(J127<K127,1,0)))","v":0},{"$f":"IF(OR(J127=\"\",K127=\"\"),\"\",IF(OR(E127=\"WO\",L127=\"WO\"),\"\",IF(J127=K127,1,0)))","v":0},{"$f":"IF(OR(J127=\"\",K127=\"\"),\"\",IF(OR(E127=\"WO\",L127=\"WO\"),\"\",IF(J127>K127,1,0)))","v":1},{"$f":"IF(OR(J127=\"\",K127=\"\"),\"\",IF(OR(E127=\"WO\",L127=\"WO\"),\"\",K127))","v":1},{"$f":"IF(OR(J127=\"\",K127=\"\"),\"\",IF(OR(E127=\"WO\",L127=\"WO\"),\"\",J127))","v":6}]
[null,null,null,58,"TUGUINHA (SP)",null,null,null,null,4,3,"PEDRINHO (SP)",null,null,null,null,null,3,9,null,0,null,1,0,0,4,3,0,0,1,3,4]
[null,null,null,57,"CAROL (SP)",null,null,null,null,1,5,"WALLACE RINCO (SP)",null,null,null,null,null,4,10,null,0,null,0,0,1,1,5,1,0,0,5,1]
[1,null,"11:30:00",59,"IGOR COSTA (SP)",null,null,null,null,5,2,"DAVI ANDRADE (SP)",null,null,null,null,null,5,11,null,0,null,{"$f":"IF(OR(J130=\"\",K130=\"\"),\"\",IF(OR(E130=\"WO\",L130=\"WO\"),\"\",IF(J130>K130,1,0)))","v":1},{"$f":"IF(OR(J130=\"\",K130=\"\"),\"\",IF(OR(E130=\"WO\",L130=\"WO\"),\"\",IF(J130=K130,1,0)))","v":0},{"$f":"IF(OR(J130=\"\",K130=\"\"),\"\",IF(OR(E130=\"WO\",L130=\"WO\"),\"\",IF(J130<K130,1,0)))","v":0},{"$f":"IF(OR(J130=\"\",K130=\"\"),\"\",IF(OR(E130=\"WO\",L130=\"WO\"),\"\",J130))","v":5},{"$f":"IF(OR(J130=\"\",K130=\"\"),\"\",IF(OR(E130=\"WO\",L130=\"WO\"),\"\",K130))","v":2},{"$f":"IF(OR(J130=\"\",K130=\"\"),\"\",IF(OR(E130=\"WO\",L130=\"WO\"),\"\",IF(J130<K130,1,0)))","v":0},{"$f":"IF(OR(J130=\"\",K130=\"\"),\"\",IF(OR(E130=\"WO\",L130=\"WO\"),\"\",IF(J130=K130,1,0)))","v":0},{"$f":"IF(OR(J130=\"\",K130=\"\"),\"\",IF(OR(E130=\"WO\",L130=\"WO\"),\"\",IF(J130>K130,1,0)))","v":1},{"$f":"IF(OR(J130=\"\",K130=\"\"),\"\",IF(OR(E130=\"WO\",L130=\"WO\"),\"\",K130))","v":2},{"$f":"IF(OR(J130=\"\",K130=\"\"),\"\",IF(OR(E130=\"WO\",L130=\"WO\"),\"\",J130))","v":5}]
[1,null,null,60,"VITOR HUGO (SP)",null,null,null,null,4,2,"MELLI JR (SP)",null,null,null,null,null,6,12,null,0,null,1,0,0,4,2,0,0,1,2,4]
[null,null,null,61,"TUSURINHA (SP)",null,null,null,null,2,8,"RODRIGO (PE)",null,null,null,null,null,7,13,null,0,null,0,0,1,2,8,1,0,0,8,2]
[null,null,null,62,"LUIZ GULHERME (SP)",null,null,null,null,3,1,"LINNO BALA (PE)",null,null,null,null,null,8,14,null,0,null,1,0,0,3,1,0,0,1,1,3]
[1,null,null,null,null,null,null,null,null,null,null,null,null,null,null,null,null,null,null,null,null,null,"","","","","","","","","",""]
[1,15,{"$f":"$C$81","v":"2022-06-18"},58,{"$f":"VLOOKUP($R135,$AU$9:$AV$24,2,0)","v":"LEO LIMA (SP)"},null,null,null,null,10,1,{"$f":"VLOOKUP($S135,$AU$9:$AV$24,2,0)","v":"VERISSON (PE)"},null,null,null,null,null,1,16,null,{"$f":"COUNTBLANK(J135:K135)","v":0},null,1,0,0,10,1,0,0,1,1,10]
[null,null,null,59,"PEDRO ANTONIO (SP)",null,null,null,null,2,2,"PEDRINHO (SP)",null,null,null,null,null,2,9,null,0,null,{"$f":"IF(OR(J136=\"\",K136=\"\"),\"\",IF(OR(E136=\"WO\",L136=\"WO\"),\"\",IF(J136>K136,1,0)))","v":0},{"$f":"IF(OR(J136=\"\",K136=\"\"),\"\",IF(OR(E136=\"WO\",L136=\"WO\"),\"\",IF(J136=K136,1,0)))","v":1},{"$f":"IF(OR(J136=\"\",K136=\"\"),\"\",IF(OR(E136=\"WO\",L136=\"WO\"),\"\",IF(J136<K136,1,0)))","v":0},{"$f":"IF(OR(J136=\"\",K136=\"\"),\"\",IF(OR(E136=\"WO\",L136=\"WO\"),\"\",J136))","v":2},{"$f":"IF(OR(J136=\"\",K136=\"\"),\"\",IF(OR(E136=\"WO\",L136=\"WO\"),\"\",K136))","v":2},{"$f":"IF(OR(J136=\"\",K136=\"\"),\"\",IF(OR(E136=\"WO\",L136=\"WO\"),\"\",IF(J136<K136,1,0)))","v":0},{"$f":"IF(OR(J136=\"\",K136=\"\"),\"\",IF(OR(E136=\"WO\",L136=\"WO\"),\"\",IF(J136=K136,1,0)))","v":1},{"$f":"IF(OR(J136=\"\",K136=\"\"),\"\",IF(OR(E136=\"WO\",L136=\"WO\"),\"\",IF(J136>K136,1,0)))","v":0},{"$f":"IF(OR(J136=\"\",K136=\"\"),\"\",IF(OR(E136=\"WO\",L136=\"WO\"),\"\",K136))","v":2},{"$f":"IF(OR(J136=\"\",K136=\"\"),\"\",IF(OR(E136=\"WO\",L136=\"WO\"),\"\",J136))","v":2}]
[null,null,null,60,"TUGUINHA (SP)",null,null,null,null,3,7,"WALLACE RINCO (SP)",null,null,null,null,null,3,10,null,0,null,0,0,1,3,7,1,0,0,7,3]
[null,null,null,61,"CAROL (SP)",null,null,null,null,1,0,"DAVI ANDRADE (SP)",null,null,null,null,null,4,11,null,0,null,1,0,0,1,0,0,0,1,0,1]
[1,null,"12:00:00",63,"IGOR COSTA (SP)",null,null,null,null,2,3,"MELLI JR (SP)",null,null,null,null,null,5,12,null,0,null,{"$f":"IF(OR(J139=\"\",K139=\"\"),\"\",IF(OR(E139=\"WO\",L139=\"WO\"),\"\",IF(J139>K139,1,0)))","v":0},{"$f":"IF(OR(J139=\"\",K139=\"\"),\"\",IF(OR(E139=\"WO\",L139=\"WO\"),\"\",IF(J139=K139,1,0)))","v":0},{"$f":"IF(OR(J139=\"\",K139=\"\"),\"\",IF(OR(E139=\"WO\",L139=\"WO\"),\"\",IF(J139<K139,1,0)))","v":1},{"$f":"IF(OR(J139=\"\",K139=\"\"),\"\",IF(OR(E139=\"WO\",L139=\"WO\"),\"\",J139))","v":2},{"$f":"IF(OR(J139=\"\",K139=\"\"),\"\",IF(OR(E139=\"WO\",L139=\"WO\"),\"\",K139))","v":3},{"$f":"IF(OR(J139=\"\",K139=\"\"),\"\",IF(OR(E139=\"WO\",L139=\"WO\"),\"\",IF(J139<K139,1,0)))","v":1},{"$f":"IF(OR(J139=\"\",K139=\"\"),\"\",IF(OR(E139=\"WO\",L139=\"WO\"),\"\",IF(J139=K139,1,0)))","v":0},{"$f":"IF(OR(J139=\"\",K139=\"\"),\"\",IF(OR(E139=\"WO\",L139=\"WO\"),\"\",IF(J139>K139,1,0)))","v":0},{"$f":"IF(OR(J139=\"\",K139=\"\"),\"\",IF(OR(E139=\"WO\",L139=\"WO\"),\"\",K139))","v":3},{"$f":"IF(OR(J139=\"\",K139=\"\"),\"\",IF(OR(E139=\"WO\",L139=\"WO\"),\"\",J139))","v":2}]
[1,null,null,62,"VITOR HUGO (SP)",null,null,null,null,4,2,"RODRIGO (PE)",null,null,null,null,null,6,13,null,0,null,{"$f":"IF(OR(J140=\"\",K140=\"\"),\"\",IF(OR(E140=\"WO\",L140=\"WO\"),\"\",IF(J140>K140,1,0)))","v":1},{"$f":"IF(OR(J140=\"\",K140=\"\"),\"\",IF(OR(E140=\"WO\",L140=\"WO\"),\"\",IF(J140=K140,1,0)))","v":0},{"$f":"IF(OR(J140=\"\",K140=\"\"),\"\",IF(OR(E140=\"WO\",L140=\"WO\"),\"\",IF(J140<K140,1,0)))","v":0},{"$f":"IF(OR(J140=\"\",K140=\"\"),\"\",IF(OR(E140=\"WO\",L140=\"WO\"),\"\",J140))","v":4},{"$f":"IF(OR(J140=\"\",K140=\"\"),\"\",IF(OR(E140=\"WO\",L140=\"WO\"),\"\",K140))","v":2},{"$f":"IF(OR(J140=\"\",K140=\"\"),\"\",IF(OR(E140=\"WO\",L140=\"WO\"),\"\",IF(J140<K140,1,0)))","v":0},{"$f":"IF(OR(J140=\"\",K140=\"\"),\"\",IF(OR(E140=\"WO\",L140=\"WO\"),\"\",IF(J140=K140,1,0)))","v":0},{"$f":"IF(OR(J140=\"\",K140=\"\"),\"\",IF(OR(E140=\"WO\",L140=\"WO\"),\"\",IF(J140>K140,1,0)))","v":1},{"$f":"IF(OR(J140=\"\",K140=\"\"),\"\",IF(OR(E140=\"WO\",L140=\"WO\"),\"\",K140))","v":2},{"$f":"IF(OR(J140=\"\",K140=\"\"),\"\",IF(OR(E140=\"WO\",L140=\"WO\"),\"\",J140))","v":4}]
[null,null,null,64,"TUSURINHA (SP)",null,null,null,null,2,3,"LINNO BALA (PE)",null,null,null,null,null,7,14,null,0,null,{"$f":"IF(OR(J141=\"\",K141=\"\"),\"\",IF(OR(E141=\"WO\",L141=\"WO\"),\"\",IF(J141>K141,1,0)))","v":0},{"$f":"IF(OR(J141=\"\",K141=\"\"),\"\",IF(OR(E141=\"WO\",L141=\"WO\"),\"\",IF(J141=K141,1,0)))","v":0},{"$f":"IF(OR(J141=\"\",K141=\"\"),\"\",IF(OR(E141=\"WO\",L141=\"WO\"),\"\",IF(J141<K141,1,0)))","v":1},{"$f":"IF(OR(J141=\"\",K141=\"\"),\"\",IF(OR(E141=\"WO\",L141=\"WO\"),\"\",J141))","v":2},{"$f":"IF(OR(J141=\"\",K141=\"\"),\"\",IF(OR(E141=\"WO\",L141=\"WO\"),\"\",K141))","v":3},{"$f":"IF(OR(J141=\"\",K141=\"\"),\"\",IF(OR(E141=\"WO\",L141=\"WO\"),\"\",IF(J141<K141,1,0)))","v":1},{"$f":"IF(OR(J141=\"\",K141=\"\"),\"\",IF(OR(E141=\"WO\",L141=\"WO\"),\"\",IF(J141=K141,1,0)))","v":0},{"$f":"IF(OR(J141=\"\",K141=\"\"),\"\",IF(OR(E141=\"WO\",L141=\"WO\"),\"\",IF(J141>K141,1,0)))","v":0},{"$f":"IF(OR(J141=\"\",K141=\"\"),\"\",IF(OR(E141=\"WO\",L141=\"WO\"),\"\",K141))","v":3},{"$f":"IF(OR(J141=\"\",K141=\"\"),\"\",IF(OR(E141=\"WO\",L141=\"WO\"),\"\",J141))","v":2}]
[null,null,null,57,"LUIZ GULHERME (SP)",null,null,null,null,3,6,"DANIEL COUTO (RJ)",null,null,null,null,null,8,15,null,0,null,{"$f":"IF(OR(J142=\"\",K142=\"\"),\"\",IF(OR(E142=\"WO\",L142=\"WO\"),\"\",IF(J142>K142,1,0)))","v":0},{"$f":"IF(OR(J142=\"\",K142=\"\"),\"\",IF(OR(E142=\"WO\",L142=\"WO\"),\"\",IF(J142=K142,1,0)))","v":0},{"$f":"IF(OR(J142=\"\",K142=\"\"),\"\",IF(OR(E142=\"WO\",L142=\"WO\"),\"\",IF(J142<K142,1,0)))","v":1},{"$f":"IF(OR(J142=\"\",K142=\"\"),\"\",IF(OR(E142=\"WO\",L142=\"WO\"),\"\",J142))","v":3},{"$f":"IF(OR(J142=\"\",K142=\"\"),\"\",IF(OR(E142=\"WO\",L142=\"WO\"),\"\",K142))","v":6},{"$f":"IF(OR(J142=\"\",K142=\"\"),\"\",IF(OR(E142=\"WO\",L142=\"WO\"),\"\",IF(J142<K142,1,0)))","v":1},{"$f":"IF(OR(J142=\"\",K142=\"\"),\"\",IF(OR(E142=\"WO\",L142=\"WO\"),\"\",IF(J142=K142,1,0)))","v":0},{"$f":"IF(OR(J142=\"\",K142=\"\"),\"\",IF(OR(E142=\"WO\",L142=\"WO\"),\"\",IF(J142>K142,1,0)))","v":0},{"$f":"IF(OR(J142=\"\",K142=\"\"),\"\",IF(OR(E142=\"WO\",L142=\"WO\"),\"\",K142))","v":6},{"$f":"IF(OR(J142=\"\",K142=\"\"),\"\",IF(OR(E142=\"WO\",L142=\"WO\"),\"\",J142))","v":3}]
[null,null,null,null,null,null,null,null,null,null,null,null,null,null,null,null,null,null,null,null,{"$f":"SUM(U9:U142)","v":0}]
[]
[null,"Class","Atletas",null,null,null,null,"PG","J","V","E","D","GP","GC","SG","Sorteio"]
[{"$f":"IF($U$143=0,\"è\",\"\")","v":"è"},1,{"$f":"VLOOKUP($B146,$AI$9:$AS$24,2,0)","v":"LEO LIMA (SP)"},null,null,null,null,{"$f":"VLOOKUP($B146,$AI$9:$AS$24,3,0)","v":43},{"$f":"VLOOKUP($B146,$AI$9:$AS$24,4,0)","v":15},{"$f":"VLOOKUP($B146,$AI$9:$AS$24,5,0)","v":14},{"$f":"VLOOKUP($B146,$AI$9:$AS$24,6,0)","v":1},{"$f":"VLOOKUP($B146,$AI$9:$AS$24,7,0)","v":0},{"$f":"VLOOKUP($B146,$AI$9:$AS$24,8,0)","v":115},{"$f":"VLOOKUP($B146,$AI$9:$AS$24,9,0)","v":29},{"$f":"VLOOKUP($B146,$AI$9:$AS$24,10,0)","v":86},{"$f":"IF(INT(AS9)=INT(AS13),ASC(CHAR(252)),\"\")","v":""}]
[{"$f":"IF($U$143=0,\"è\",\"\")","v":"è"},2,"DANIEL COUTO (RJ)",null,null,null,null,40,15,13,1,1,79,34,45,{"$f":"IF(OR(INT(AS13)=INT(AS9),INT(AS14)=INT(AS13)),ASC(CHAR(252)),\"\")","v":""}]
["è",3,"WALLACE RINCO (SP)",null,null,null,null,40,15,13,1,1,77,36,41,{"$f":"IF(OR(INT(AS14)=INT(AS13),INT(AS16)=INT(AS14)),ASC(CHAR(252)),\"\")","v":""}]
["è",4,"RODRIGO (PE)",null,null,null,null,28,15,9,1,5,59,48,11,{"$f":"IF(OR(INT(AS16)=INT(AS14),INT(AS17)=INT(AS16)),ASC(CHAR(252)),\"\")","v":""}]
["è",5,"MELLI JR (SP)",null,null,null,null,28,15,9,1,5,44,46,-2,{"$f":"IF(OR(INT(AS17)=INT(AS16),INT(AS18)=INT(AS17)),ASC(CHAR(252)),\"\")","v":""}]
["è",6,"IGOR COSTA (SP)",null,null,null,null,24,15,8,0,7,39,42,-3,{"$f":"IF(OR(INT(AS18)=INT(AS17),INT(AS19)=INT(AS18)),ASC(CHAR(252)),\"\")","v":""}]
["è",7,"TUSURINHA (SP)",null,null,null,null,21,15,7,0,8,31,49,-18,""]
["è",8,"LUIZ GULHERME (SP)",null,null,null,null,20,15,6,2,7,40,43,-3,""]
[null,9,"VITOR HUGO (SP)",null,null,null,null,19,15,5,4,6,35,41,-6,""]
[null,10,"PEDRO ANTONIO (SP)",null,null,null,null,18,15,5,3,7,38,45,-7,""]
[null,11,"TUGUINHA (SP)",null,null,null,null,17,15,5,2,8,31,54,-23,""]
[null,12,"LINNO BALA (PE)",null,null,null,null,15,15,4,3,8,31,52,-21,{"$f":"IF(OR(INT(AS18)=INT(AS17),INT(AS22)=INT(AS18)),ASC(CHAR(252)),\"\")","v":""}]
[null,13,"PEDRINHO (SP)",null,null,null,null,14,15,3,5,7,31,40,-9,{"$f":"IF(OR(INT(AS22)=INT(AS18),INT(AS23)=INT(AS22)),ASC(CHAR(252)),\"\")","v":""}]
[null,14,"VERISSON (PE)",null,null,null,null,10,15,3,1,11,22,50,-28,{"$f":"IF(OR(INT(AS23)=INT(AS22),INT(AS24)=INT(AS23)),ASC(CHAR(252)),\"\")","v":""}]
[null,15,"DAVI ANDRADE (SP)",null,null,null,null,7,15,2,1,12,14,43,-29,{"$f":"IF(OR(INT(AS22)=INT(AS18),INT(AS23)=INT(AS22)),ASC(CHAR(252)),\"\")","v":""}]
[null,16,"CAROL (SP)",null,null,null,null,3,15,1,0,14,18,52,-34,{"$f":"IF(OR(INT(AS23)=INT(AS22),INT(AS25)=INT(AS23)),ASC(CHAR(252)),\"\")","v":""}]
[]
[null,"è","QF (Ouro)"]

{"sheet":"QF","index":4,"n_rows":20,"n_cols":19,"rows_kept":20,"cut":false,"hidden":false,"merged":[[2,1,2,15],[3,1,3,15],[19,9,19,10],[8,1,18,1],[8,2,13,2],[14,2,18,2],[11,3,13,3],[8,3,10,3],[14,3,16,3],[14,4,14,8],[14,11,14,15],[16,9,16,10],[17,3,18,3],[17,4,17,8],[17,11,17,15],[11,11,11,15],[13,9,13,10],[6,4,6,15],[8,4,8,8],[8,11,8,15],[10,9,10,10],[11,4,11,8]]}
[]
[]
[]
[null,"                            32o CAMPEONATO BRASILEIRO INDIVIDUAL"]
[]
[null,{"$f":"CONCATENATE(INFO!$C$4, \" | \", \"1a Divisão\")","v":"SUB-18 | 1a Divisão"},null,null,null,null,null,null,null,null,null,null,null,null,null,"Quartas de Final"]
["Grp","Rod.","Data/Hora","Mesas","Jogos"]
[]
[null,"QF","2022-06-19","57",{"$f":"RESUMO!$B$3","v":"LEO LIMA (SP)"},null,null,null,null,6,4,{"$f":"RESUMO!$B$10","v":"LUIZ GULHERME (SP)"}]
[null,null,null,null,{"$f":"CONCATENATE(RESUMO!$A$3,\" Col\")","v":"1o Col"},{"$f":"RESUMO!$C$3","v":43},{"$f":"RESUMO!$E$3","v":14},{"$f":"RESUMO!$J$3","v":86},{"$f":"RESUMO!$H$3","v":115},{"$f":"IF(R10=0,\" \",IF(R10>S10,\"*\",\" \"))","v":"*"},{"$f":"IF(S10=0,\" \",IF(J10=\"*\",\" \",\"*\"))","v":" "},{"$f":"RESUMO!$C$10","v":20},{"$f":"RESUMO!$E$10","v":6},{"$f":"RESUMO!$J$10","v":-3},{"$f":"RESUMO!$H$10","v":40},{"$f":"CONCATENATE(RESUMO!$A$10,\" Col\")","v":"8o Col"},null,{"$f":"(F10*1000000000)+(G10*1000000)+(H10*1000)+I10","v":43014086115},{"$f":"(L10*1000000000)+(M10*1000000)+(N10*1000)+O10","v":20005997040}]
[null,null,null,null,null,{"$f":"IF(J11>0,0,IF(J9>K9,3,IF(J9=K9,1,0)))","v":3},{"$f":"IF(F11=3,1,0)","v":1},{"$f":"IF(J11>0,0,J9-K9)","v":2},{"$f":"IF(J11>0,0,J9)","v":6},{"$f":"COUNTBLANK(J9:K9)","v":0},null,{"$f":"IF(J11>0,0,IF(K9>J9,3,IF(K9=J9,1,0)))","v":0},{"$f":"IF(L11=3,1,0)","v":0},{"$f":"IF(J11>0,0,K9-J9)","v":-2},{"$f":"IF(J11>0,0,K9)","v":4}]
[null,null,null,"58",{"$f":"RESUMO!$B$4","v":"DANIEL COUTO (RJ)"},null,null,null,null,7,2,{"$f":"RESUMO!$B$9","v":"TUSURINHA (SP)"}]
[null,null,null,null,{"$f":"CONCATENATE(RESUMO!$A$4,\" Col\")","v":"2o Col"},{"$f":"RESUMO!$C$4","v":40},{"$f":"RESUMO!$E$4","v":13},{"$f":"RESUMO!$J$4","v":45},{"$f":"RESUMO!$H$4","v":79},{"$f":"IF(R13=0,\" \",IF(R13>S13,\"*\",\" \"))","v":"*"},{"$f":"IF(S13=0,\" \",IF(J13=\"*\",\" \",\"*\"))","v":" "},{"$f":"RESUMO!$C$9","v":21},{"$f":"RESUMO!$E$9","v":7},{"$f":"RESUMO!$J$9","v":-18},{"$f":"RESUMO!$H$9","v":31},{"$f":"CONCATENATE(RESUMO!$A$9,\" Col\")","v":"7o Col"},null,{"$f":"(F13*1000000000)+(G13*1000000)+(H13*1000)+I13","v":40013045079},{"$f":"(L13*1000000000)+(M13*1000000)+(N13*1000)+O13","v":21006982031}]
[null,null,null,null,null,{"$f":"IF(J14>0,0,IF(J12>K12,3,IF(J12=K12,1,0)))","v":3},{"$f":"IF(F14=3,1,0)","v":1},{"$f":"IF(J14>0,0,J12-K12)","v":5},{"$f":"IF(J14>0,0,J12)","v":7},{"$f":"COUNTBLANK(J12:K12)","v":0},null,{"$f":"IF(J14>0,0,IF(K12>J12,3,IF(K12=J12,1,0)))","v":0},{"$f":"IF(L14=3,1,0)","v":0},{"$f":"IF(J14>0,0,K12-J12)","v":-5},{"$f":"IF(J14>0,0,K12)","v":2}]
[null,null,"09:00:00","59",{"$f":"RESUMO!$B$5","v":"WALLACE RINCO (SP)"},null,null,null,null,6,1,{"$f":"RESUMO!$B$8","v":"IGOR COSTA (SP)"}]
[null,null,null,null,{"$f":"CONCATENATE(RESUMO!$A$5,\" Col\")","v":"3o Col"},{"$f":"RESUMO!$C$5","v":40},{"$f":"RESUMO!$E$5","v":13},{"$f":"RESUMO!$J$5","v":41},{"$f":"RESUMO!$H$5","v":77},{"$f":"IF(R16=0,\" \",IF(R16>S16,\"*\",\" \"))","v":"*"},{"$f":"IF(S16=0,\" \",IF(J16=\"*\",\" \",\"*\"))","v":" "},{"$f":"RESUMO!$C$8","v":24},{"$f":"RESUMO!$E$8","v":8},{"$f":"RESUMO!$J$8","v":-3},{"$f":"RESUMO!$H$8","v":39},{"$f":"CONCATENATE(RESUMO!$A$8,\" Col\")","v":"6o Col"},null,{"$f":"(F16*1000000000)+(G16*1000000)+(H16*1000)+I16","v":40013041077},{"$f":"(L16*1000000000)+(M16*1000000)+(N16*1000)+O16","v":24007997039}]
[null,null,null,null,null,{"$f":"IF(J17>0,0,IF(J15>K15,3,IF(J15=K15,1,0)))","v":3},{"$f":"IF(F17=3,1,0)","v":1},{"$f":"IF(J17>0,0,J15-K15)","v":5},{"$f":"IF(J17>0,0,J15)","v":6},{"$f":"COUNTBLANK(J15:K15)","v":0},null,{"$f":"IF(J17>0,0,IF(K15>J15,3,IF(K15=J15,1,0)))","v":0},{"$f":"IF(L17=3,1,0)","v":0},{"$f":"IF(J17>0,0,K15-J15)","v":-5},{"$f":"IF(J17>0,0,K15)","v":1}]
[null,null,null,"60",{"$f":"RESUMO!$B$6","v":"RODRIGO (PE)"},null,null,null,null,3,2,{"$f":"RESUMO!$B$7","v":"MELLI JR (SP)"}]
[null,null,null,null,{"$f":"CONCATENATE(RESUMO!$A$6,\" Col\")","v":"4o Col"},{"$f":"RESUMO!$C$6","v":28},{"$f":"RESUMO!$E$6","v":9},{"$f":"RESUMO!$J$6","v":11},{"$f":"RESUMO!$H$6","v":59},{"$f":"IF(R19=0,\" \",IF(R19>S19,\"*\",\" \"))","v":"*"},{"$f":"IF(S19=0,\" \",IF(J19=\"*\",\" \",\"*\"))","v":" "},{"$f":"RESUMO!$C$7","v":28},{"$f":"RESUMO!$E$7","v":9},{"$f":"RESUMO!$J$7","v":-2},{"$f":"RESUMO!$H$7","v":44},{"$f":"CONCATENATE(RESUMO!$A$7,\" Col\")","v":"5o Col"},null,{"$f":"(F19*1000000000)+(G19*1000000)+(H19*1000)+I19","v":28009011059},{"$f":"(L19*1000000000)+(M19*1000000)+(N19*1000)+O19","v":28008998044}]
[null,null,null,null,null,{"$f":"IF(J20>0,0,IF(J18>K18,3,IF(J18=K18,1,0)))","v":3},{"$f":"IF(F20=3,1,0)","v":1},{"$f":"IF(J20>0,0,J18-K18)","v":1},{"$f":"IF(J20>0,0,J18)","v":3},{"$f":"COUNTBLANK(J18:K18)","v":0},null,{"$f":"IF(J20>0,0,IF(K18>J18,3,IF(K18=J18,1,0)))","v":0},{"$f":"IF(L20=3,1,0)","v":0},{"$f":"IF(J20>0,0,K18-J18)","v":-1},{"$f":"IF(J20>0,0,K18)","v":2}]

{"sheet":"SF","index":5,"n_rows":14,"n_cols":19,"rows_kept":14,"cut":false,"hidden":false,"merged":[[13,9,13,10],[6,4,6,15],[8,1,12,1],[8,3,9,3],[8,4,8,8],[8,11,8,15],[10,9,10,10],[11,3,12,3],[11,4,11,8],[2,1,2,15],[3,1,3,15],[11,2,12,2],[8,2,10,2],[11,11,11,15]]}
[]
[]
[]
[null,"                            32o CAMPEONATO BRASILEIRO INDIVIDUAL"]
[]
[null,{"$f":"CONCATENATE(INFO!$C$4, \" | \", \"1a Divisão\")","v":"SUB-18 | 1a Divisão"},null,null,null,null,null,null,null,null,null,null,null,null,null,"Semifinal"]
["Grp","Rod.","Data/Hora","Mesas","Jogos"]
[]
[null,"SF","2022-06-19","61",{"$f":"RESUMO!$B$47","v":"LEO LIMA (SP)"},null,null,null,null,4,1,{"$f":"RESUMO!$B$50","v":"RODRIGO (PE)"}]
[null,null,null,null,{"$f":"CONCATENATE(RESUMO!$N$47,\"o MC\")","v":"1o MC"},{"$f":"RESUMO!$C$47","v":46},{"$f":"RESUMO!$E$47","v":15},{"$f":"RESUMO!$J$47","v":88},{"$f":"RESUMO!$H$47","v":121},{"$f":"IF(R10=0,\" \",IF(R10>S10,\"*\",\" \"))","v":"*"},{"$f":"IF(S10=0,\" \",IF(J10=\"*\",\" \",\"*\"))","v":" "},{"$f":"RESUMO!$C$50","v":31},{"$f":"RESUMO!$E$50","v":10},{"$f":"RESUMO!$J$50","v":12},{"$f":"RESUMO!$H$50","v":118},{"$f":"CONCATENATE(RESUMO!$N$50,\"o MC\")","v":"4o MC"},null,{"$f":"(F10*1000000000)+(G10*1000000)+(H10*1000)+I10","v":46015088121},{"$f":"(L10*1000000000)+(M10*1000000)+(N10*1000)+O10","v":31010012118}]
[null,null,null,null,null,{"$f":"IF(J11>0,0,IF(J9>K9,3,IF(J9=K9,1,0)))","v":3},{"$f":"IF(F11=3,1,0)","v":1},{"$f":"IF(J11>0,0,J9-K9)","v":3},{"$f":"IF(J11>0,0,J9)","v":4},{"$f":"COUNTBLANK(J9:K9)","v":0},null,{"$f":"IF(J11>0,0,IF(K9>J9,3,IF(K9=J9,1,0)))","v":0},{"$f":"IF(L11=3,1,0)","v":0},{"$f":"IF(J11>0,0,K9-J9)","v":-3},{"$f":"IF(J11>0,0,K9)","v":1}]
[null,null,"09:30:00",{"$f":"D9+1","v":62},{"$f":"RESUMO!$B$48","v":"DANIEL COUTO (RJ)"},null,null,null,null,5,2,{"$f":"RESUMO!$B$49","v":"WALLACE RINCO (SP)"}]
[null,null,null,null,{"$f":"CONCATENATE(RESUMO!$N$48,\"o MC\")","v":"2o MC"},{"$f":"RESUMO!$C$48","v":43},{"$f":"RESUMO!$E$48","v":14},{"$f":"RESUMO!$J$48","v":50},{"$f":"RESUMO!$H$48","v":86},{"$f":"IF(R13=0,\" \",IF(R13>S13,\"*\",\" \"))","v":"*"},{"$f":"IF(S13=0,\" \",IF(J13=\"*\",\" \",\"*\"))","v":" "},{"$f":"RESUMO!$C$49","v":43},{"$f":"RESUMO!$E$49","v":14},{"$f":"RESUMO!$J$49","v":46},{"$f":"RESUMO!$H$49","v":83},{"$f":"CONCATENATE(RESUMO!$N$49,\"o MC\")","v":"3o MC"},null,{"$f":"(F13*1000000000)+(G13*1000000)+(H13*1000)+I13","v":43014050086},{"$f":"(L13*1000000000)+(M13*1000000)+(N13*1000)+O13","v":43014046083}]
[null,null,null,null,null,{"$f":"IF(J14>0,0,IF(J12>K12,3,IF(J12=K12,1,0)))","v":3},{"$f":"IF(F14=3,1,0)","v":1},{"$f":"IF(J14>0,0,J12-K12)","v":3},{"$f":"IF(J14>0,0,J12)","v":5},{"$f":"COUNTBLANK(J12:K12)","v":0},null,{"$f":"IF(J14>0,0,IF(K12>J12,3,IF(K12=J12,1,0)))","v":0},{"$f":"IF(L14=3,1,0)","v":0},{"$f":"IF(J14>0,0,K12-J12)","v":-3},{"$f":"IF(J14>0,0,K12)","v":2}]

{"sheet":"F","index":6,"n_rows":18,"n_cols":19,"rows_kept":18,"cut":false,"hidden":false,"merged":[[2,1,2,15],[3,1,3,15],[13,4,13,15],[8,1,9,1],[15,1,16,1],[15,3,16,3],[15,4,15,8],[15,11,15,15],[17,9,17,10],[6,4,6,15],[8,3,9,3],[8,4,8,8],[8,11,8,15],[10,9,10,10]]}
[]
[]
[]
[null,"                            32o CAMPEONATO BRASILEIRO INDIVIDUAL"]
[]
[null,{"$f":"CONCATENATE(INFO!$C$4, \" | \", \"1a Divisão\")","v":"SUB-18 | 1a Divisão"},null,null,null,null,null,null,null,null,null,null,null,null,null,"Final"]
["Grp","Rod.","Data/Hora","Mesa","Jogos"]
[]
[null,"F","2022-06-19","63",{"$f":"RESUMO!$B$68","v":"LEO LIMA (SP)"},null,null,null,null,9,3,{"$f":"RESUMO!$B$69","v":"DANIEL COUTO (RJ)"}]
[null,null,"10:00:00",null,{"$f":"CONCATENATE(RESUMO!$N$68,\"o MC\")","v":"1o MC"},{"$f":"RESUMO!$C$68","v":49},{"$f":"RESUMO!$E$68","v":16},{"$f":"RESUMO!$J$68","v":91},{"$f":"RESUMO!$H$68","v":125},{"$f":"IF(R10=0,\" \",IF(R10>S10,\"*\",\" \"))","v":"*"},{"$f":"IF(S10=0,\" \",IF(J10=\"*\",\" \",\"*\"))","v":" "},{"$f":"RESUMO!$C$69","v":46},{"$f":"RESUMO!$E$69","v":15},{"$f":"RESUMO!$J$69","v":53},{"$f":"RESUMO!$H$69","v":91},{"$f":"CONCATENATE(RESUMO!$N$69,\"o MC\")","v":"2o MC"},null,{"$f":"(F10*1000000000)+(G10*1000000)+(H10*1000)+I10","v":49016091125},{"$f":"(L10*1000000000)+(M10*1000000)+(N10*1000)+O10","v":46015053091}]
[null,null,null,null,null,{"$f":"IF(J11>0,0,IF(J9>K9,3,IF(J9=K9,1,0)))","v":3},{"$f":"IF(F11=3,1,0)","v":1},{"$f":"IF(J11>0,0,J9-K9)","v":6},{"$f":"IF(J11>0,0,J9)","v":9},{"$f":"COUNTBLANK(J9:K9)","v":0},null,{"$f":"IF(J11>0,0,IF(K9>J9,3,IF(K9=J9,1,0)))","v":0},{"$f":"IF(L11=3,1,0)","v":0},{"$f":"IF(J11>0,0,K9-J9)","v":-6},{"$f":"IF(J11>0,0,K9)","v":3}]
[]
[null,{"$f":"CONCATENATE(INFO!$C$4, \" | \", \"1a Divisão\")","v":"SUB-18 | 1a Divisão"},null,null,null,null,null,null,null,null,null,null,null,null,null,"Disputa de 3o Lugar"]
["Grp","Rod.","Data/Hora","Mesa","Jogos"]
[]
[null,"D3º","2022-06-19","64",{"$f":"RESUMO!$B$70","v":"WALLACE RINCO (SP)"},null,null,null,null,3,5,{"$f":"RESUMO!$B$71","v":"RODRIGO (PE)"}]
[null,null,"10:00:00",null,{"$f":"CONCATENATE(RESUMO!$N$70,\"o MC\")","v":"1o MC"},{"$f":"RESUMO!$C$70","v":43},{"$f":"RESUMO!$E$70","v":14},{"$f":"RESUMO!$J$70","v":43},{"$f":"RESUMO!$H$70","v":85},{"$f":"IF(R17=0,\" \",IF(R17>S17,\"*\",\" \"))","v":"*"},{"$f":"IF(S17=0,\" \",IF(J17=\"*\",\" \",\"*\"))","v":" "},{"$f":"RESUMO!$C$71","v":31},{"$f":"RESUMO!$E$71","v":10},{"$f":"RESUMO!$J$71","v":9},{"$f":"RESUMO!$H$71","v":119},{"$f":"CONCATENATE(RESUMO!$N$71,\"o MC\")","v":"2o MC"},null,{"$f":"(F17*1000000000)+(G17*1000000)+(H17*1000)+I17","v":43014043085},{"$f":"(L17*1000000000)+(M17*1000000)+(N17*1000)+O17","v":31010009119}]
[null,null,null,null,null,{"$f":"IF(J18>0,0,IF(J16>K16,3,IF(J16=K16,1,0)))","v":0},{"$f":"IF(F18=3,1,0)","v":0},{"$f":"IF(J18>0,0,J16-K16)","v":-2},{"$f":"IF(J18>0,0,J16)","v":3},{"$f":"COUNTBLANK(J16:K16)","v":0},null,{"$f":"IF(J18>0,0,IF(K16>J16,3,IF(K16=J16,1,0)))","v":3},{"$f":"IF(L18=3,1,0)","v":1},{"$f":"IF(J18>0,0,K16-J16)","v":2},{"$f":"IF(J18>0,0,K16)","v":5}]

{"sheet":"CLASS","index":7,"n_rows":24,"n_cols":11,"rows_kept":24,"cut":false,"hidden":false,"merged":[[6,0,6,10],[4,0,4,10],[5,0,5,10]]}
[]
[]
[]
[]
[{"$f":"INFO!$C$1","v":"32o CAMPEONATO BRASILEIRO INDIVIDUAL"}]
[{"$f":"CONCATENATE(INFO!$A$4, INFO!$C$4)","v":"CATEGORIA:SUB-18"}]
["Classificação Final"]
["Colocação","Atletas","PG","J","V","E","D","GP","GC","SG","IA%"]
[{"$f":"RESUMO!$A115","v":1},{"$f":"RESUMO!$B115","v":"LEO LIMA (SP)"},{"$f":"RESUMO!C115","v":52},{"$f":"RESUMO!D115","v":18},{"$f":"RESUMO!E115","v":17},{"$f":"RESUMO!F115","v":1},{"$f":"RESUMO!G115","v":0},{"$f":"RESUMO!H115","v":134},{"$f":"RESUMO!I115","v":37},{"$f":"RESUMO!J115","v":97},{"$f":"($C9)/(3*$D9)","v":0.96296296296296291}]
[{"$f":"RESUMO!$A116","v":2},{"$f":"RESUMO!$B116","v":"DANIEL COUTO (RJ)"},{"$f":"RESUMO!C116","v":46},{"$f":"RESUMO!D116","v":18},{"$f":"RESUMO!E116","v":15},{"$f":"RESUMO!F116","v":1},{"$f":"RESUMO!G116","v":2},{"$f":"RESUMO!H116","v":94},{"$f":"RESUMO!I116","v":47},{"$f":"RESUMO!J116","v":47},{"$f":"($C10)/(3*$D10)","v":0.85185185185185186}]
[{"$f":"RESUMO!$A117","v":3},{"$f":"RESUMO!$B117","v":"WALLACE RINCO (SP)"},{"$f":"RESUMO!C117","v":43},{"$f":"RESUMO!D117","v":17},{"$f":"RESUMO!E117","v":14},{"$f":"RESUMO!F117","v":1},{"$f":"RESUMO!G117","v":2},{"$f":"RESUMO!H117","v":85},{"$f":"RESUMO!I117","v":42},{"$f":"RESUMO!J117","v":43},0.84313725490196079]
[{"$f":"RESUMO!$A118","v":4},{"$f":"RESUMO!$B118","v":"RODRIGO (PE)"},{"$f":"RESUMO!C118","v":31},{"$f":"RESUMO!D118","v":17},{"$f":"RESUMO!E118","v":10},{"$f":"RESUMO!F118","v":1},{"$f":"RESUMO!G118","v":6},{"$f":"RESUMO!H118","v":119},{"$f":"RESUMO!I118","v":110},{"$f":"RESUMO!J118","v":9},0.60784313725490191]
[{"$f":"RESUMO!$A119","v":5},{"$f":"RESUMO!$B119","v":"MELLI JR (SP)"},{"$f":"RESUMO!C119","v":28},{"$f":"RESUMO!D119","v":16},{"$f":"RESUMO!E119","v":9},{"$f":"RESUMO!F119","v":1},{"$f":"RESUMO!G119","v":6},{"$f":"RESUMO!H119","v":88},{"$f":"RESUMO!I119","v":91},{"$f":"RESUMO!J119","v":-3},0.58333333333333337]
[{"$f":"RESUMO!$A120","v":6},{"$f":"RESUMO!$B120","v":"IGOR COSTA (SP)"},{"$f":"RESUMO!C120","v":24},{"$f":"RESUMO!D120","v":16},{"$f":"RESUMO!E120","v":8},{"$f":"RESUMO!F120","v":0},{"$f":"RESUMO!G120","v":8},{"$f":"RESUMO!H120","v":40},{"$f":"RESUMO!I120","v":48},{"$f":"RESUMO!J120","v":-8},0.5]
[{"$f":"RESUMO!$A121","v":7},{"$f":"RESUMO!$B121","v":"TUSURINHA (SP)"},{"$f":"RESUMO!C121","v":21},{"$f":"RESUMO!D121","v":16},{"$f":"RESUMO!E121","v":7},{"$f":"RESUMO!F121","v":0},{"$f":"RESUMO!G121","v":9},{"$f":"RESUMO!H121","v":33},{"$f":"RESUMO!I121","v":56},{"$f":"RESUMO!J121","v":-23},0.4375]
[{"$f":"RESUMO!$A122","v":8},{"$f":"RESUMO!$B122","v":"LUIZ GULHERME (SP)"},{"$f":"RESUMO!C122","v":20},{"$f":"RESUMO!D122","v":16},{"$f":"RESUMO!E122","v":6},{"$f":"RESUMO!F122","v":2},{"$f":"RESUMO!G122","v":8},{"$f":"RESUMO!H122","v":44},{"$f":"RESUMO!I122","v":49},{"$f":"RESUMO!J122","v":-5},0.41666666666666669]
[{"$f":"RESUMO!$A123","v":9},{"$f":"RESUMO!$B123","v":"VITOR HUGO (SP)"},{"$f":"RESUMO!C123","v":19},{"$f":"RESUMO!D123","v":15},{"$f":"RESUMO!E123","v":5},{"$f":"RESUMO!F123","v":4},{"$f":"RESUMO!G123","v":6},{"$f":"RESUMO!H123","v":35},{"$f":"RESUMO!I123","v":41},{"$f":"RESUMO!J123","v":-6},0.42222222222222222]
[{"$f":"RESUMO!$A124","v":10},{"$f":"RESUMO!$B124","v":"PEDRO ANTONIO (SP)"},{"$f":"RESUMO!C124","v":18},{"$f":"RESUMO!D124","v":15},{"$f":"RESUMO!E124","v":5},{"$f":"RESUMO!F124","v":3},{"$f":"RESUMO!G124","v":7},{"$f":"RESUMO!H124","v":38},{"$f":"RESUMO!I124","v":45},{"$f":"RESUMO!J124","v":-7},0.4]
[{"$f":"RESUMO!$A125","v":11},{"$f":"RESUMO!$B125","v":"TUGUINHA (SP)"},{"$f":"RESUMO!C125","v":17},{"$f":"RESUMO!D125","v":15},{"$f":"RESUMO!E125","v":5},{"$f":"RESUMO!F125","v":2},{"$f":"RESUMO!G125","v":8},{"$f":"RESUMO!H125","v":31},{"$f":"RESUMO!I125","v":54},{"$f":"RESUMO!J125","v":-23},0.37777777777777777]
[{"$f":"RESUMO!$A126","v":12},{"$f":"RESUMO!$B126","v":"LINNO BALA (PE)"},{"$f":"RESUMO!C126","v":15},{"$f":"RESUMO!D126","v":15},{"$f":"RESUMO!E126","v":4},{"$f":"RESUMO!F126","v":3},{"$f":"RESUMO!G126","v":8},{"$f":"RESUMO!H126","v":31},{"$f":"RESUMO!I126","v":52},{"$f":"RESUMO!J126","v":-21},0.33333333333333331]
[{"$f":"RESUMO!$A127","v":13},{"$f":"RESUMO!$B127","v":"PEDRINHO (SP)"},{"$f":"RESUMO!C127","v":14},{"$f":"RESUMO!D127","v":15},{"$f":"RESUMO!E127","v":3},{"$f":"RESUMO!F127","v":5},{"$f":"RESUMO!G127","v":7},{"$f":"RESUMO!H127","v":31},{"$f":"RESUMO!I127","v":40},{"$f":"RESUMO!J127","v":-9},0.31111111111111112]
[{"$f":"RESUMO!$A128","v":14},{"$f":"RESUMO!$B128","v":"VERISSON (PE)"},{"$f":"RESUMO!C128","v":10},{"$f":"RESUMO!D128","v":15},{"$f":"RESUMO!E128","v":3},{"$f":"RESUMO!F128","v":1},{"$f":"RESUMO!G128","v":11},{"$f":"RESUMO!H128","v":22},{"$f":"RESUMO!I128","v":50},{"$f":"RESUMO!J128","v":-28},0.22222222222222221]
[{"$f":"RESUMO!$A129","v":15},{"$f":"RESUMO!$B129","v":"DAVI ANDRADE (SP)"},{"$f":"RESUMO!C129","v":7},{"$f":"RESUMO!D129","v":15},{"$f":"RESUMO!E129","v":2},{"$f":"RESUMO!F129","v":1},{"$f":"RESUMO!G129","v":12},{"$f":"RESUMO!H129","v":14},{"$f":"RESUMO!I129","v":43},{"$f":"RESUMO!J129","v":-29},0.15555555555555556]
[{"$f":"RESUMO!$A130","v":16},{"$f":"RESUMO!$B130","v":"CAROL (SP)"},{"$f":"RESUMO!C130","v":3},{"$f":"RESUMO!D130","v":15},{"$f":"RESUMO!E130","v":1},{"$f":"RESUMO!F130","v":0},{"$f":"RESUMO!G130","v":14},{"$f":"RESUMO!H130","v":18},{"$f":"RESUMO!I130","v":52},{"$f":"RESUMO!J130","v":-34},6.6666666666666666E-2]

{"sheet":"RESUMO","index":8,"n_rows":130,"n_cols":17,"rows_kept":130,"cut":false,"hidden":false,"merged":[[112,0,112,12],[79,0,79,12],[86,0,86,12],[93,0,93,12],[19,0,19,12],[30,0,30,12],[44,0,44,12],[37,0,37,12],[65,0,65,12],[16,39,16,40],[16,41,16,48],[16,56,16,63],[51,0,51,12],[72,0,72,12],[58,0,58,12],[17,16,17,23],[17,31,17,38],[17,14,17,15],[13,14,13,15],[13,16,13,23],[13,31,13,38],[16,14,16,15],[16,16,16,23],[16,31,16,38],[4,56,4,63],[3,41,3,48],[3,56,3,63],[4,41,4,48],[6,56,6,63],[5,41,5,48],[5,56,5,63],[6,41,6,48],[0,0,0,12],[1,56,1,63],[2,41,2,48],[2,56,2,63],[1,41,1,48],[2,39,2,40],[2,31,2,38],[2,16,2,23],[2,14,2,15],[1,39,1,40],[1,31,1,38],[1,16,1,23],[1,14,1,15],[6,39,6,40],[6,31,6,38],[6,16,6,23],[6,14,6,15],[5,39,5,40],[5,31,5,38],[5,16,5,23],[5,14,5,15],[4,39,4,40],[4,31,4,38],[4,16,4,23],[4,14,4,15],[3,39,3,40],[3,31,3,38],[3,16,3,23],[3,14,3,15]]}
["Resumo da 1a Fase"]
["Ref.","Atletas","PG","J","V","E","D","GP","GC","SG","Class","Chave","Key"]
[{"$f":"CONCATENATE('F1'!$B146,\"o\")","v":"1o"},{"$f":"'F1'!C146","v":"LEO LIMA (SP)"},{"$f":"'F1'!H146","v":43},{"$f":"'F1'!I146","v":15},{"$f":"'F1'!J146","v":14},{"$f":"'F1'!K146","v":1},{"$f":"'F1'!L146","v":0},{"$f":"'F1'!M146","v":115},{"$f":"'F1'!N146","v":29},{"$f":"'F1'!O146","v":86},1,{"$f":"(C3*1000000000)+(E3*1000000)+(J3*1000)+H3","v":43014086115},1]
[{"$f":"CONCATENATE('F1'!$B147,\"o\")","v":"2o"},{"$f":"'F1'!C147","v":"DANIEL COUTO (RJ)"},{"$f":"'F1'!H147","v":40},{"$f":"'F1'!I147","v":15},{"$f":"'F1'!J147","v":13},{"$f":"'F1'!K147","v":1},{"$f":"'F1'!L147","v":1},{"$f":"'F1'!M147","v":79},{"$f":"'F1'!N147","v":34},{"$f":"'F1'!O147","v":45},1,{"$f":"(C4*1000000000)+(E4*1000000)+(J4*1000)+H4","v":40013045079},2]
[{"$f":"CONCATENATE('F1'!$B148,\"o\")","v":"3o"},{"$f":"'F1'!C148","v":"WALLACE RINCO (SP)"},{"$f":"'F1'!H148","v":40},{"$f":"'F1'!I148","v":15},{"$f":"'F1'!J148","v":13},{"$f":"'F1'!K148","v":1},{"$f":"'F1'!L148","v":1},{"$f":"'F1'!M148","v":77},{"$f":"'F1'!N148","v":36},{"$f":"'F1'!O148","v":41},1,40013041077,3]
[{"$f":"CONCATENATE('F1'!$B149,\"o\")","v":"4o"},{"$f":"'F1'!C149","v":"RODRIGO (PE)"},{"$f":"'F1'!H149","v":28},{"$f":"'F1'!I149","v":15},{"$f":"'F1'!J149","v":9},{"$f":"'F1'!K149","v":1},{"$f":"'F1'!L149","v":5},{"$f":"'F1'!M149","v":59},{"$f":"'F1'!N149","v":48},{"$f":"'F1'!O149","v":11},1,28009011059,4]
[{"$f":"CONCATENATE('F1'!$B150,\"o\")","v":"5o"},{"$f":"'F1'!C150","v":"MELLI JR (SP)"},{"$f":"'F1'!H150","v":28},{"$f":"'F1'!I150","v":15},{"$f":"'F1'!J150","v":9},{"$f":"'F1'!K150","v":1},{"$f":"'F1'!L150","v":5},{"$f":"'F1'!M150","v":44},{"$f":"'F1'!N150","v":46},{"$f":"'F1'!O150","v":-2},1,28008998044,5]
[{"$f":"CONCATENATE('F1'!$B151,\"o\")","v":"6o"},{"$f":"'F1'!C151","v":"IGOR COSTA (SP)"},{"$f":"'F1'!H151","v":24},{"$f":"'F1'!I151","v":15},{"$f":"'F1'!J151","v":8},{"$f":"'F1'!K151","v":0},{"$f":"'F1'!L151","v":7},{"$f":"'F1'!M151","v":39},{"$f":"'F1'!N151","v":42},{"$f":"'F1'!O151","v":-3},1,{"$f":"(C8*1000000000)+(E8*1000000)+(J8*1000)+H8","v":24007997039},6]
[{"$f":"CONCATENATE('F1'!$B152,\"o\")","v":"7o"},{"$f":"'F1'!C152","v":"TUSURINHA (SP)"},{"$f":"'F1'!H152","v":21},{"$f":"'F1'!I152","v":15},{"$f":"'F1'!J152","v":7},{"$f":"'F1'!K152","v":0},{"$f":"'F1'!L152","v":8},{"$f":"'F1'!M152","v":31},{"$f":"'F1'!N152","v":49},{"$f":"'F1'!O152","v":-18},1,21006982031,7]
[{"$f":"CONCATENATE('F1'!$B153,\"o\")","v":"8o"},{"$f":"'F1'!C153","v":"LUIZ GULHERME (SP)"},{"$f":"'F1'!H153","v":20},{"$f":"'F1'!I153","v":15},{"$f":"'F1'!J153","v":6},{"$f":"'F1'!K153","v":2},{"$f":"'F1'!L153","v":7},{"$f":"'F1'!M153","v":40},{"$f":"'F1'!N153","v":43},{"$f":"'F1'!O153","v":-3},1,20005997040,8]
[{"$f":"CONCATENATE('F1'!$B154,\"o\")","v":"9o"},{"$f":"'F1'!C154","v":"VITOR HUGO (SP)"},{"$f":"'F1'!H154","v":19},{"$f":"'F1'!I154","v":15},{"$f":"'F1'!J154","v":5},{"$f":"'F1'!K154","v":4},{"$f":"'F1'!L154","v":6},{"$f":"'F1'!M154","v":35},{"$f":"'F1'!N154","v":41},{"$f":"'F1'!O154","v":-6},9,19004994035,9]
[{"$f":"CONCATENATE('F1'!$B155,\"o\")","v":"10o"},{"$f":"'F1'!C155","v":"PEDRO ANTONIO (SP)"},{"$f":"'F1'!H155","v":18},{"$f":"'F1'!I155","v":15},{"$f":"'F1'!J155","v":5},{"$f":"'F1'!K155","v":3},{"$f":"'F1'!L155","v":7},{"$f":"'F1'!M155","v":38},{"$f":"'F1'!N155","v":45},{"$f":"'F1'!O155","v":-7},9,18004993038,10]
[{"$f":"CONCATENATE('F1'!$B156,\"o\")","v":"11o"},{"$f":"'F1'!C156","v":"TUGUINHA (SP)"},{"$f":"'F1'!H156","v":17},{"$f":"'F1'!I156","v":15},{"$f":"'F1'!J156","v":5},{"$f":"'F1'!K156","v":2},{"$f":"'F1'!L156","v":8},{"$f":"'F1'!M156","v":31},{"$f":"'F1'!N156","v":54},{"$f":"'F1'!O156","v":-23},9,17004977031,11]
[{"$f":"CONCATENATE('F1'!$B157,\"o\")","v":"12o"},{"$f":"'F1'!C157","v":"LINNO BALA (PE)"},{"$f":"'F1'!H157","v":15},{"$f":"'F1'!I157","v":15},{"$f":"'F1'!J157","v":4},{"$f":"'F1'!K157","v":3},{"$f":"'F1'!L157","v":8},{"$f":"'F1'!M157","v":31},{"$f":"'F1'!N157","v":52},{"$f":"'F1'!O157","v":-21},9,15003979031,12]
[{"$f":"CONCATENATE('F1'!$B158,\"o\")","v":"13o"},{"$f":"'F1'!C158","v":"PEDRINHO (SP)"},{"$f":"'F1'!H158","v":14},{"$f":"'F1'!I158","v":15},{"$f":"'F1'!J158","v":3},{"$f":"'F1'!K158","v":5},{"$f":"'F1'!L158","v":7},{"$f":"'F1'!M158","v":31},{"$f":"'F1'!N158","v":40},{"$f":"'F1'!O158","v":-9},9,14002991031,13]
[{"$f":"CONCATENATE('F1'!$B159,\"o\")","v":"14o"},{"$f":"'F1'!C159","v":"VERISSON (PE)"},{"$f":"'F1'!H159","v":10},{"$f":"'F1'!I159","v":15},{"$f":"'F1'!J159","v":3},{"$f":"'F1'!K159","v":1},{"$f":"'F1'!L159","v":11},{"$f":"'F1'!M159","v":22},{"$f":"'F1'!N159","v":50},{"$f":"'F1'!O159","v":-28},9,10002972022,14]
[{"$f":"CONCATENATE('F1'!$B160,\"o\")","v":"15o"},{"$f":"'F1'!C160","v":"DAVI ANDRADE (SP)"},{"$f":"'F1'!H160","v":7},{"$f":"'F1'!I160","v":15},{"$f":"'F1'!J160","v":2},{"$f":"'F1'!K160","v":1},{"$f":"'F1'!L160","v":12},{"$f":"'F1'!M160","v":14},{"$f":"'F1'!N160","v":43},{"$f":"'F1'!O160","v":-29},9,7001971014,15]
[{"$f":"CONCATENATE('F1'!$B161,\"o\")","v":"16o"},{"$f":"'F1'!C161","v":"CAROL (SP)"},{"$f":"'F1'!H161","v":3},{"$f":"'F1'!I161","v":15},{"$f":"'F1'!J161","v":1},{"$f":"'F1'!K161","v":0},{"$f":"'F1'!L161","v":14},{"$f":"'F1'!M161","v":18},{"$f":"'F1'!N161","v":52},{"$f":"'F1'!O161","v":-34},9,3000966018,16]
[]
["Resumo das Quartas de Final"]
["Ref.","Atletas","PG","J","V","E","D","GP","GC","SG","Class","Chave","Key"]
[{"$f":"IF($K22=1,\"V. QF1\",\"P.QF1\")","v":"V. QF1"},{"$f":"$B$3","v":"LEO LIMA (SP)"},{"$f":"QF!F11","v":3},{"$f":"SUM(E22:G22)","v":1},{"$f":"QF!G11","v":1},{"$f":"IF(C22=1,1,0)","v":0},{"$f":"IF(H22<I22,1,IF($H$22:$H$23=0,0,1-E22-F22))","v":0},{"$f":"QF!I11","v":6},{"$f":"H22-J22","v":4},{"$f":"QF!H11","v":2},{"$f":"IF(C22=3,1,IF(AND(C22=1,L22>L23),1,IF(D22=0,0,5)))","v":1},{"$f":"$L$3","v":43014086115},{"$f":"VLOOKUP(B22,$B$3:$M$18,12,FALSE)","v":1}]
[{"$f":"IF($K23=1,\"V. QF1\",\"P. QF1\")","v":"P. QF1"},{"$f":"$B$10","v":"LUIZ GULHERME (SP)"},{"$f":"QF!L11","v":0},{"$f":"SUM(E23:G23)","v":1},{"$f":"QF!M11","v":0},{"$f":"IF(C23=1,1,0)","v":0},{"$f":"IF(H23<I23,1,IF($H$22:$H$23=0,0,1-E23-F23))","v":1},{"$f":"QF!O11","v":4},6,{"$f":"QF!N11","v":-2},{"$f":"IF(C23=3,1,IF(AND(C23=1,L22>L23),1,IF(D23=0,0,5)))","v":5},{"$f":"$L$10","v":20005997040},8]
[{"$f":"IF($K24=1,\"V. QF2\",\"P. QF2\")","v":"V. QF2"},{"$f":"$B$4","v":"DANIEL COUTO (RJ)"},{"$f":"QF!F14","v":3},1,{"$f":"QF!G14","v":1},0,{"$f":"IF(H24<I24,1,IF($H$24:$H$25=0,0,1-E24-F24))","v":0},{"$f":"QF!I14","v":7},2,{"$f":"QF!H14","v":5},{"$f":"IF(C24=3,1,IF(AND(C24=1,L24>L25),1,IF(D24=0,0,5)))","v":1},{"$f":"$L$4","v":40013045079},2]
[{"$f":"IF($K25=1,\"V. QF2\",\"P. QF2\")","v":"P. QF2"},{"$f":"$B$9","v":"TUSURINHA (SP)"},{"$f":"QF!L14","v":0},1,{"$f":"QF!M14","v":0},0,{"$f":"IF(H25<I25,1,IF($H$24:$H$25=0,0,1-E25-F25))","v":1},{"$f":"QF!O14","v":2},7,{"$f":"QF!N14","v":-5},{"$f":"IF(C25=3,1,IF(AND(C25=1,L24>L25),1,IF(D25=0,0,5)))","v":5},{"$f":"$L$9","v":21006982031},7]
[{"$f":"IF($K26=1,\"V. QF3\",\"P. QF3\")","v":"V. QF3"},{"$f":"$B$5","v":"WALLACE RINCO (SP)"},{"$f":"QF!F17","v":3},{"$f":"SUM(E26:G26)","v":1},{"$f":"QF!G17","v":1},{"$f":"IF(C26=1,1,0)","v":0},{"$f":"IF(H26<I26,1,IF($H$26:$H$27=0,0,1-E26-F26))","v":0},{"$f":"QF!I17","v":6},{"$f":"H26-J26","v":1},{"$f":"QF!H17","v":5},{"$f":"IF(C26=3,1,IF(AND(C26=1,L26>L27),1,IF(D26=0,0,5)))","v":1},{"$f":"$L$5","v":40013041077},{"$f":"VLOOKUP(B26,$B$3:$M$18,12,FALSE)","v":3}]
[{"$f":"IF($K27=1,\"V. QF3\",\"P. QF3\")","v":"P. QF3"},{"$f":"$B$8","v":"IGOR COSTA (SP)"},{"$f":"QF!L17","v":0},{"$f":"SUM(E27:G27)","v":1},{"$f":"QF!M17","v":0},{"$f":"IF(C27=1,1,0)","v":0},{"$f":"IF(H27<I27,1,IF($H$26:$H$27=0,0,1-E27-F27))","v":1},{"$f":"QF!O17","v":1},6,{"$f":"QF!N17","v":-5},{"$f":"IF(C27=3,1,IF(AND(C27=1,L26>L27),1,IF(D27=0,0,5)))","v":5},{"$f":"$L$8","v":24007997039},{"$f":"VLOOKUP(B27,$B$3:$M$18,12,FALSE)","v":6}]
[{"$f":"IF($K28=1,\"V. QF4\",\"P. QF4\")","v":"V. QF4"},{"$f":"$B$6","v":"RODRIGO (PE)"},{"$f":"QF!F20","v":3},{"$f":"SUM(E28:G28)","v":1},{"$f":"QF!G20","v":1},{"$f":"IF(C28=1,1,0)","v":0},{"$f":"IF(H28<I28,1,IF($H$28:$H$29=0,0,1-E28-F28))","v":0},{"$f":"QF!I19","v":59},{"$f":"H28-J28","v":58},{"$f":"QF!H20","v":1},{"$f":"IF(C28=3,1,IF(AND(C28=1,L28>L29),1,IF(D28=0,0,5)))","v":1},{"$f":"$L$6","v":28009011059},{"$f":"VLOOKUP(B28,$B$3:$M$18,12,FALSE)","v":4}]
[{"$f":"IF($K29=1,\"V. QF4\",\"P. QF4\")","v":"P. QF4"},{"$f":"$B$7","v":"MELLI JR (SP)"},{"$f":"QF!L20","v":0},{"$f":"SUM(E29:G29)","v":1},{"$f":"QF!M20","v":0},{"$f":"IF(C29=1,1,0)","v":0},{"$f":"IF(H29<I29,1,IF($H$28:$H$29=0,0,1-E29-F29))","v":1},{"$f":"QF!O19","v":44},45,{"$f":"QF!N20","v":-1},{"$f":"IF(C29=3,1,IF(AND(C29=1,L28>L29),1,IF(D29=0,0,5)))","v":5},{"$f":"$L$7","v":28008998044},{"$f":"VLOOKUP(B29,$B$3:$M$18,12,FALSE)","v":5}]
[]
["Resumo Acumulado até as Quartas de Final dos Vencedores"]
["Ref.","Atletas","PG","J","V","E","D","GP","GC","SG","Class","Chave","Key","Rank"]
[{"$f":"IF($K$22=1,$A$22,$A$23)","v":"V. QF1"},{"$f":"IF($K$22=1,$B$22,$B$23)","v":"LEO LIMA (SP)"},{"$f":"VLOOKUP($B33,$B$3:$K$18,2,FALSE)+VLOOKUP($B33,$B$22:$K$29,2,FALSE)","v":46},{"$f":"VLOOKUP($B33,$B$3:$K$18,3,FALSE)+VLOOKUP($B33,$B$22:$K$29,3,FALSE)","v":16},{"$f":"VLOOKUP($B33,$B$3:$K$18,4,FALSE)+VLOOKUP($B33,$B$22:$K$29,4,FALSE)","v":15},{"$f":"VLOOKUP($B33,$B$3:$K$18,5,FALSE)+VLOOKUP($B33,$B$22:$K$29,5,FALSE)","v":1},{"$f":"VLOOKUP($B33,$B$3:$K$18,6,FALSE)+VLOOKUP($B33,$B$22:$K$29,6,FALSE)","v":0},{"$f":"VLOOKUP($B33,$B$3:$K$18,7,FALSE)+VLOOKUP($B33,$B$22:$K$29,7,FALSE)","v":121},{"$f":"VLOOKUP($B33,$B$3:$K$18,8,FALSE)+VLOOKUP($B33,$B$22:$K$29,8,FALSE)","v":33},{"$f":"VLOOKUP($B33,$B$3:$K$18,9,FALSE)+VLOOKUP($B33,$B$22:$K$29,9,FALSE)","v":88},{"$f":"VLOOKUP($B33,$B$22:$K$29,10,FALSE)","v":1},{"$f":"(C33*1000000000)+(E33*1000000)+(J33*1000)+H33","v":46015088121},{"$f":"VLOOKUP(B33,$B$3:$M$18,12,FALSE)","v":1},{"$f":"RANK(L33,$L$33:$L$36)","v":1},{"$f":"A33","v":"V. QF1"},null,{"$f":"B33","v":"LEO LIMA (SP)"}]
[{"$f":"IF($K$24=1,$A$24,$A$25)","v":"V. QF2"},{"$f":"IF($K$24=1,$B$24,$B$25)","v":"DANIEL COUTO (RJ)"},{"$f":"VLOOKUP($B34,$B$3:$K$18,2,FALSE)+VLOOKUP($B34,$B$22:$K$29,2,FALSE)","v":43},{"$f":"VLOOKUP($B34,$B$3:$K$18,3,FALSE)+VLOOKUP($B34,$B$22:$K$29,3,FALSE)","v":16},{"$f":"VLOOKUP($B34,$B$3:$K$18,4,FALSE)+VLOOKUP($B34,$B$22:$K$29,4,FALSE)","v":14},{"$f":"VLOOKUP($B34,$B$3:$K$18,5,FALSE)+VLOOKUP($B34,$B$22:$K$29,5,FALSE)","v":1},{"$f":"VLOOKUP($B34,$B$3:$K$18,6,FALSE)+VLOOKUP($B34,$B$22:$K$29,6,FALSE)","v":1},{"$f":"VLOOKUP($B34,$B$3:$K$18,7,FALSE)+VLOOKUP($B34,$B$22:$K$29,7,FALSE)","v":86},{"$f":"VLOOKUP($B34,$B$3:$K$18,8,FALSE)+VLOOKUP($B34,$B$22:$K$29,8,FALSE)","v":36},{"$f":"VLOOKUP($B34,$B$3:$K$18,9,FALSE)+VLOOKUP($B34,$B$22:$K$29,9,FALSE)","v":50},{"$f":"VLOOKUP($B34,$B$22:$K$29,10,FALSE)","v":1},{"$f":"(C34*1000000000)+(E34*1000000)+(J34*1000)+H34","v":43014050086},{"$f":"VLOOKUP(B34,$B$3:$M$18,12,FALSE)","v":2},{"$f":"RANK(L34,$L$33:$L$36)","v":2},{"$f":"A34","v":"V. QF2"},null,{"$f":"B34","v":"DANIEL COUTO (RJ)"}]
[{"$f":"IF($K$26=1,$A$26,$A$27)","v":"V. QF3"},{"$f":"IF($K$26=1,$B$26,$B$27)","v":"WALLACE RINCO (SP)"},{"$f":"VLOOKUP($B35,$B$3:$K$18,2,FALSE)+VLOOKUP($B35,$B$22:$K$29,2,FALSE)","v":43},16,14,1,1,83,37,46,1,43014046083,{"$f":"VLOOKUP(B35,$B$3:$M$18,12,FALSE)","v":3},3,"V. QF3",null,"WALLACE RINCO (SP)"]
[{"$f":"IF($K$28=1,$A$28,$A$29)","v":"V. QF4"},{"$f":"IF($K$28=1,$B$28,$B$29)","v":"RODRIGO (PE)"},{"$f":"VLOOKUP($B36,$B$3:$K$18,2,FALSE)+VLOOKUP($B36,$B$22:$K$29,2,FALSE)","v":31},16,10,1,5,118,106,12,1,31010012118,{"$f":"VLOOKUP(B36,$B$3:$M$18,12,FALSE)","v":4},4,"V. QF4",null,"RODRIGO (PE)"]
[]
["Resumo Acumulado até as Quartas de Final dos ELIMINADOS"]
["Ref.","Atletas","PG","J","V","E","D","GP","GC","SG","Class","Chave","Key","Rank"]
[{"$f":"IF($K$22=5,$A$22,$A$23)","v":"P. QF1"},{"$f":"IF($K$22=5,$B$22,$B$23)","v":"LUIZ GULHERME (SP)"},20,16,6,2,8,44,49,-5,5,{"$f":"(C40*1000000000)+(E40*1000000)+(J40*1000)+H40","v":20005995044},{"$f":"VLOOKUP(B40,$B$3:$M$18,12,FALSE)","v":8},{"$f":"RANK(L40,$L$40:$L$43)","v":4},{"$f":"A40","v":"P. QF1"},null,{"$f":"B40","v":"LUIZ GULHERME (SP)"}]
[{"$f":"IF($K$24=5,$A$24,$A$25)","v":"P. QF2"},{"$f":"IF($K$24=5,$B$24,$B$25)","v":"TUSURINHA (SP)"},21,16,7,0,9,33,56,-23,5,{"$f":"(C41*1000000000)+(E41*1000000)+(J41*1000)+H41","v":21006977033},{"$f":"VLOOKUP(B41,$B$3:$M$18,12,FALSE)","v":7},{"$f":"RANK(L41,$L$40:$L$43)","v":3},"P. QF2",null,{"$f":"B41","v":"TUSURINHA (SP)"}]
[{"$f":"IF($K$26=5,$A$26,$A$27)","v":"P. QF3"},{"$f":"IF($K$26=5,$B$26,$B$27)","v":"IGOR COSTA (SP)"},24,16,8,0,8,40,48,-8,5,24007992040,{"$f":"VLOOKUP(B42,$B$3:$M$18,12,FALSE)","v":6},2,"P. QF3",null,{"$f":"B42","v":"IGOR COSTA (SP)"}]
[{"$f":"IF($K$28=5,$A$28,$A$29)","v":"P. QF4"},{"$f":"IF($K$28=5,$B$28,$B$29)","v":"MELLI JR (SP)"},28,16,9,1,6,88,91,-3,5,28008997088,{"$f":"VLOOKUP(B43,$B$3:$M$18,12,FALSE)","v":5},1,"P. QF4",null,{"$f":"B43","v":"MELLI JR (SP)"}]
[]
["Resumo Geral da Classificação até as Quartas de Final"]
["Ref.","Atletas","PG","J","V","E","D","GP","GC","SG","Class","Chave","Key","Rank"]
[{"$f":"VLOOKUP(N47,$N$33:$Q$36,2,FALSE)","v":"V. QF1"},{"$f":"VLOOKUP(N47,$N$33:$Q$36,4,FALSE)","v":"LEO LIMA (SP)"},{"$f":"VLOOKUP($B47,$B$33:$M$36,2,)","v":46},{"$f":"VLOOKUP($B47,$B$33:$M$36,3,)","v":16},{"$f":"VLOOKUP($B47,$B$33:$M$36,4,)","v":15},{"$f":"VLOOKUP($B47,$B$33:$M$36,5,)","v":1},{"$f":"VLOOKUP($B47,$B$33:$M$36,6,)","v":0},{"$f":"VLOOKUP($B47,$B$33:$M$36,7,)","v":121},{"$f":"VLOOKUP($B47,$B$33:$M$36,8,)","v":33},{"$f":"VLOOKUP($B47,$B$33:$M$36,9,)","v":88},{"$f":"VLOOKUP($B47,$B$33:$M$36,10,)","v":1},{"$f":"VLOOKUP($B47,$B$33:$M$36,11,)","v":46015088121},{"$f":"VLOOKUP(B47,$B$3:$M$18,12,FALSE)","v":1},1]
[{"$f":"VLOOKUP(N48,$N$33:$Q$36,2,FALSE)","v":"V. QF2"},{"$f":"VLOOKUP(N48,$N$33:$Q$36,4,FALSE)","v":"DANIEL COUTO (RJ)"},{"$f":"VLOOKUP($B48,$B$33:$M$36,2,)","v":43},{"$f":"VLOOKUP($B48,$B$33:$M$36,3,)","v":16},{"$f":"VLOOKUP($B48,$B$33:$M$36,4,)","v":14},{"$f":"VLOOKUP($B48,$B$33:$M$36,5,)","v":1},{"$f":"VLOOKUP($B48,$B$33:$M$36,6,)","v":1},{"$f":"VLOOKUP($B48,$B$33:$M$36,7,)","v":86},{"$f":"VLOOKUP($B48,$B$33:$M$36,8,)","v":36},{"$f":"VLOOKUP($B48,$B$33:$M$36,9,)","v":50},{"$f":"VLOOKUP($B48,$B$33:$M$36,10,)","v":1},{"$f":"VLOOKUP($B48,$B$33:$M$36,11,)","v":43014050086},{"$f":"VLOOKUP(B48,$B$3:$M$18,12,FALSE)","v":2},2]
["V. QF3",{"$f":"VLOOKUP(N49,$N$33:$Q$36,4,FALSE)","v":"WALLACE RINCO (SP)"},43,16,14,1,1,83,37,46,1,43014046083,{"$f":"VLOOKUP(B49,$B$3:$M$18,12,FALSE)","v":3},3]
["V. QF4","RODRIGO (PE)",31,16,10,1,5,118,106,12,1,31010012118,{"$f":"VLOOKUP(B50,$B$3:$M$18,12,FALSE)","v":4},4]
[]
["Resumo das Semifinais"]
["Ref.","Atletas","PG","J","V","E","D","GP","GC","SG","Class","Chave","Key"]
[{"$f":"CONCATENATE($N47,\"o MC\")","v":"1o MC"},{"$f":"$B$47","v":"LEO LIMA (SP)"},{"$f":"SF!F11","v":3},{"$f":"SUM(E54:G54)","v":1},{"$f":"SF!G11","v":1},{"$f":"IF(C54=1,1,0)","v":0},{"$f":"IF(H54<I54,1,IF($H$54:$H$55=0,0,1-E54-F54))","v":0},{"$f":"SF!I11","v":4},{"$f":"H54-J54","v":1},{"$f":"SF!H11","v":3},{"$f":"IF(C54=3,1,IF(AND(C54=1,L54>L55),1,IF(D54=0,0,3)))","v":1},{"$f":"$L$47","v":46015088121},{"$f":"VLOOKUP(B54,$B$3:$M$18,12,FALSE)","v":1}]
[{"$f":"CONCATENATE($N50,\"o MC\")","v":"4o MC"},{"$f":"$B$50","v":"RODRIGO (PE)"},{"$f":"SF!L11","v":0},{"$f":"SUM(E55:G55)","v":1},{"$f":"SF!M11","v":0},{"$f":"IF(C55=1,1,0)","v":0},{"$f":"IF(H55<I55,1,IF($H$54:$H$55=0,0,1-E55-F55))","v":1},{"$f":"SF!O11","v":1},4,{"$f":"SF!N11","v":-3},{"$f":"IF(C55=3,1,IF(AND(C55=1,L55>L54),1,IF(D55=0,0,3)))","v":3},{"$f":"$L$50","v":31010012118},{"$f":"VLOOKUP(B55,$B$3:$M$18,12,FALSE)","v":4}]
[{"$f":"CONCATENATE($N48,\"o MC\")","v":"2o MC"},{"$f":"$B$48","v":"DANIEL COUTO (RJ)"},{"$f":"SF!F14","v":3},1,{"$f":"SF!G14","v":1},0,{"$f":"IF(H56<I56,1,IF($H$56:$H$57=0,0,1-E56-F56))","v":0},{"$f":"SF!I14","v":5},2,{"$f":"SF!H14","v":3},{"$f":"IF(C56=3,1,IF(AND(C56=1,L56>L55),1,IF(D56=0,0,3)))","v":1},{"$f":"$L$48","v":43014050086},{"$f":"VLOOKUP(B56,$B$3:$M$18,12,FALSE)","v":2}]
[{"$f":"CONCATENATE($N49,\"o MC\")","v":"3o MC"},{"$f":"$B$49","v":"WALLACE RINCO (SP)"},{"$f":"SF!L14","v":0},1,{"$f":"SF!M14","v":0},0,{"$f":"IF(H57<I57,1,IF($H$56:$H$57=0,0,1-E57-F57))","v":1},{"$f":"SF!O14","v":2},5,{"$f":"SF!N14","v":-3},{"$f":"IF(C57=3,1,IF(AND(C57=1,L57>L56),1,IF(D57=0,0,3)))","v":3},{"$f":"$L$49","v":43014046083},{"$f":"VLOOKUP(B57,$B$3:$M$18,12,FALSE)","v":3}]
[]
["Resumo Acumulado até as Semifinais"]
["Ref.","Atletas","PG","J","V","E","D","GP","GC","SG","Class","Chave","Key","Rank"]
["V. SF1",{"$f":"IF($K$54=1,$B$54,$B$55)","v":"LEO LIMA (SP)"},{"$f":"VLOOKUP($B61,$B$47:$K$50,2,FALSE)+VLOOKUP($B61,$B$54:$K$57,2,FALSE)","v":49},{"$f":"VLOOKUP($B61,$B$47:$K$50,3,FALSE)+VLOOKUP($B61,$B$54:$K$57,3,FALSE)","v":17},{"$f":"VLOOKUP($B61,$B$47:$K$50,4,FALSE)+VLOOKUP($B61,$B$54:$K$57,4,FALSE)","v":16},{"$f":"VLOOKUP($B61,$B$47:$K$50,5,FALSE)+VLOOKUP($B61,$B$54:$K$57,5,FALSE)","v":1},{"$f":"VLOOKUP($B61,$B$47:$K$50,6,FALSE)+VLOOKUP($B61,$B$54:$K$57,6,FALSE)","v":0},{"$f":"VLOOKUP($B61,$B$47:$K$50,7,FALSE)+VLOOKUP($B61,$B$54:$K$57,7,FALSE)","v":125},{"$f":"VLOOKUP($B61,$B$47:$K$50,8,FALSE)+VLOOKUP($B61,$B$54:$K$57,8,FALSE)","v":34},{"$f":"VLOOKUP($B61,$B$47:$K$50,9,FALSE)+VLOOKUP($B61,$B$54:$K$57,9,FALSE)","v":91},{"$f":"VLOOKUP($B61,$B$54:$K$57,10,FALSE)","v":1},{"$f":"(C61*1000000000)+(E61*1000000)+(J61*1000)+H61","v":49016091125},{"$f":"VLOOKUP(B61,$B$3:$M$18,12,FALSE)","v":1},{"$f":"RANK(L61,$L$61:$L$62)","v":1},{"$f":"A61","v":"V. SF1"},null,{"$f":"B61","v":"LEO LIMA (SP)"}]
["V. SF2",{"$f":"IF($K$56=1,$B$56,$B$57)","v":"DANIEL COUTO (RJ)"},{"$f":"VLOOKUP($B62,$B$47:$K$50,2,FALSE)+VLOOKUP($B62,$B$54:$K$57,2,FALSE)","v":46},{"$f":"VLOOKUP($B62,$B$47:$K$50,3,FALSE)+VLOOKUP($B62,$B$54:$K$57,3,FALSE)","v":17},{"$f":"VLOOKUP($B62,$B$47:$K$50,4,FALSE)+VLOOKUP($B62,$B$54:$K$57,4,FALSE)","v":15},{"$f":"VLOOKUP($B62,$B$47:$K$50,5,FALSE)+VLOOKUP($B62,$B$54:$K$57,5,FALSE)","v":1},{"$f":"VLOOKUP($B62,$B$47:$K$50,6,FALSE)+VLOOKUP($B62,$B$54:$K$57,6,FALSE)","v":1},{"$f":"VLOOKUP($B62,$B$47:$K$50,7,FALSE)+VLOOKUP($B62,$B$54:$K$57,7,FALSE)","v":91},{"$f":"VLOOKUP($B62,$B$47:$K$50,8,FALSE)+VLOOKUP($B62,$B$54:$K$57,8,FALSE)","v":38},{"$f":"VLOOKUP($B62,$B$47:$K$50,9,FALSE)+VLOOKUP($B62,$B$54:$K$57,9,FALSE)","v":53},{"$f":"VLOOKUP($B62,$B$54:$K$57,10,FALSE)","v":1},{"$f":"(C62*1000000000)+(E62*1000000)+(J62*1000)+H62","v":46015053091},{"$f":"VLOOKUP(B62,$B$3:$M$18,12,FALSE)","v":2},{"$f":"RANK(L62,$L$61:$L$62)","v":2},{"$f":"A62","v":"V. SF2"},null,{"$f":"B62","v":"DANIEL COUTO (RJ)"}]
["P. SF1",{"$f":"IF($K$54=3,$B$54,$B$55)","v":"RODRIGO (PE)"},31,17,10,1,6,119,110,9,{"$f":"VLOOKUP($B63,$B$54:$K$57,10,FALSE)","v":3},31010009119,{"$f":"VLOOKUP(B63,$B$3:$M$18,12,FALSE)","v":4},{"$f":"RANK(L63,$L$63:$L$64)","v":2},"P. SF1",null,"RODRIGO (PE)"]
["P. SF2",{"$f":"IF($K$56=3,$B$56,$B$57)","v":"WALLACE RINCO (SP)"},43,17,14,1,2,85,42,43,{"$f":"VLOOKUP($B64,$B$54:$K$57,10,FALSE)","v":3},43014043085,{"$f":"VLOOKUP(B64,$B$3:$M$18,12,FALSE)","v":3},{"$f":"RANK(L64,$L$63:$L$64)","v":1},"P. SF2",null,"WALLACE RINCO (SP)"]
[]
["Resumo Geral da Classificação até as Semifianis"]
["Ref.","Atletas","PG","J","V","E","D","GP","GC","SG","Class","Chave","Key","Rank"]
[{"$f":"VLOOKUP(N68,$N$61:$Q$62,2,FALSE)","v":"V. SF1"},{"$f":"VLOOKUP(N68,$N$61:$Q$62,4,FALSE)","v":"LEO LIMA (SP)"},{"$f":"VLOOKUP($B68,$B$61:$M$64,2,)","v":49},{"$f":"VLOOKUP($B68,$B$61:$M$64,3,)","v":17},{"$f":"VLOOKUP($B68,$B$61:$M$64,4,)","v":16},{"$f":"VLOOKUP($B68,$B$61:$M$64,5,)","v":1},{"$f":"VLOOKUP($B68,$B$61:$M$64,6,)","v":0},{"$f":"VLOOKUP($B68,$B$61:$M$64,7,)","v":125},{"$f":"VLOOKUP($B68,$B$61:$M$64,8,)","v":34},{"$f":"VLOOKUP($B68,$B$61:$M$64,9,)","v":91},{"$f":"VLOOKUP($B68,$B$61:$M$64,10,)","v":1},{"$f":"VLOOKUP($B68,$B$61:$M$64,11,)","v":49016091125},{"$f":"VLOOKUP(B68,$B$3:$M$18,12,FALSE)","v":1},1]
[{"$f":"VLOOKUP(N69,$N$61:$Q$62,2,FALSE)","v":"V. SF2"},{"$f":"VLOOKUP(N69,$N$61:$Q$62,4,FALSE)","v":"DANIEL COUTO (RJ)"},{"$f":"VLOOKUP($B69,$B$61:$M$64,2,)","v":46},{"$f":"VLOOKUP($B69,$B$61:$M$64,3,)","v":17},{"$f":"VLOOKUP($B69,$B$61:$M$64,4,)","v":15},{"$f":"VLOOKUP($B69,$B$61:$M$64,5,)","v":1},{"$f":"VLOOKUP($B69,$B$61:$M$64,6,)","v":1},{"$f":"VLOOKUP($B69,$B$61:$M$64,7,)","v":91},{"$f":"VLOOKUP($B69,$B$61:$M$64,8,)","v":38},{"$f":"VLOOKUP($B69,$B$61:$M$64,9,)","v":53},{"$f":"VLOOKUP($B69,$B$61:$M$64,10,)","v":1},{"$f":"VLOOKUP($B69,$B$61:$M$64,11,)","v":46015053091},{"$f":"VLOOKUP(B69,$B$3:$M$18,12,FALSE)","v":2},2]
[{"$f":"VLOOKUP(N70,$N$63:$Q$64,2,FALSE)","v":"P. SF2"},{"$f":"VLOOKUP(N70,$N$63:$Q$64,4,FALSE)","v":"WALLACE RINCO (SP)"},43,17,14,1,2,85,42,43,3,43014043085,{"$f":"VLOOKUP(B70,$B$3:$M$18,12,FALSE)","v":3},1]
[{"$f":"VLOOKUP(N71,$N$63:$Q$64,2,FALSE)","v":"P. SF1"},{"$f":"VLOOKUP(N71,$N$63:$Q$64,4,FALSE)","v":"RODRIGO (PE)"},31,17,10,1,6,119,110,9,3,31010009119,{"$f":"VLOOKUP(B71,$B$3:$M$18,12,FALSE)","v":4},2]
[]
["Resumo das Finais"]
["Ref.","Atletas","PG","J","V","E","D","GP","GC","SG","Class","Chave","Key"]
[{"$f":"$A68","v":"V. SF1"},{"$f":"$B68","v":"LEO LIMA (SP)"},{"$f":"F!F11","v":3},{"$f":"SUM(E75:G75)","v":1},{"$f":"F!G11","v":1},{"$f":"IF(C75=1,1,0)","v":0},{"$f":"IF(H75<I75,1,IF($H$75:$H$76=0,0,1-E75-F75))","v":0},{"$f":"F!I11","v":9},{"$f":"H75-J75","v":3},{"$f":"F!H11","v":6},{"$f":"IF(C75=3,1,IF(AND(C75=1,L75>L76),1,IF(D75=0,0,2)))","v":1},{"$f":"$L68","v":49016091125},{"$f":"VLOOKUP(B75,$B$3:$M$17,12,FALSE)","v":1}]
[{"$f":"$A69","v":"V. SF2"},{"$f":"$B69","v":"DANIEL COUTO (RJ)"},{"$f":"F!L11","v":0},{"$f":"SUM(E76:G76)","v":1},{"$f":"F!M11","v":0},{"$f":"IF(C76=1,1,0)","v":0},{"$f":"IF(H76<I76,1,IF($H$75:$H$76=0,0,1-E76-F76))","v":1},{"$f":"F!O11","v":3},{"$f":"H76-J76","v":9},{"$f":"F!N11","v":-6},{"$f":"IF(C76=3,1,IF(AND(C76=1,L75>L76),1,IF(D76=0,0,2)))","v":2},{"$f":"$L69","v":46015053091},{"$f":"VLOOKUP(B76,$B$3:$M$17,12,FALSE)","v":2}]
["P. SF2","WALLACE RINCO (SP)",{"$f":"F!F18","v":0},1,{"$f":"F!G18","v":0},0,{"$f":"IF(H77<I77,1,IF($H$77:$H$78=0,0,1-E77-F77))","v":1},{"$f":"F!I18","v":3},5,{"$f":"F!H18","v":-2},{"$f":"IF(C77=3,3,IF(AND(C77=1,L77>L78),3,IF(D77=0,0,4)))","v":4},43014043085,{"$f":"VLOOKUP(B77,$B$3:$M$17,12,FALSE)","v":3}]
["P. SF1","RODRIGO (PE)",{"$f":"F!L18","v":3},1,{"$f":"F!M18","v":1},0,{"$f":"IF(H78<I78,1,IF($H$77:$H$78=0,0,1-E78-F78))","v":0},{"$f":"F!O18","v":5},3,{"$f":"F!N18","v":2},{"$f":"IF(C78=3,3,IF(AND(C78=1,L78>L79),3,IF(D78=0,0,4)))","v":3},31010009119,{"$f":"VLOOKUP(B78,$B$3:$M$17,12,FALSE)","v":4}]
[]
["Resumo Acumulado até as Finais"]
["Ref.","Atletas","PG","J","V","E","D","GP","GC","SG","Class","Chave","Key","Rank"]
["V. F.",{"$f":"IF($K$75=1,$B$75,$B$76)","v":"LEO LIMA (SP)"},{"$f":"VLOOKUP($B82,$B$68:$K$71,2,FALSE)+VLOOKUP($B82,$B$75:$K$78,2,FALSE)","v":52},{"$f":"VLOOKUP($B82,$B$68:$K$71,3,FALSE)+VLOOKUP($B82,$B$75:$K$78,3,FALSE)","v":18},{"$f":"VLOOKUP($B82,$B$68:$K$71,4,FALSE)+VLOOKUP($B82,$B$75:$K$78,4,FALSE)","v":17},{"$f":"VLOOKUP($B82,$B$68:$K$71,5,FALSE)+VLOOKUP($B82,$B$75:$K$78,5,FALSE)","v":1},{"$f":"VLOOKUP($B82,$B$68:$K$71,6,FALSE)+VLOOKUP($B82,$B$75:$K$78,6,FALSE)","v":0},{"$f":"VLOOKUP($B82,$B$68:$K$71,7,FALSE)+VLOOKUP($B82,$B$75:$K$78,7,FALSE)","v":134},{"$f":"VLOOKUP($B82,$B$68:$K$71,8,FALSE)+VLOOKUP($B82,$B$75:$K$78,8,FALSE)","v":37},{"$f":"VLOOKUP($B82,$B$68:$K$71,9,FALSE)+VLOOKUP($B82,$B$75:$K$78,9,FALSE)","v":97},{"$f":"VLOOKUP($B82,$B$75:$K$78,10,FALSE)","v":1},{"$f":"(C82*1000000000)+(E82*1000000)+(J82*1000)+H82","v":52017097134},{"$f":"VLOOKUP(B82,$B$3:$M$18,12,FALSE)","v":1},{"$f":"RANK(L82,$L$82:$L$83)","v":1},{"$f":"A82","v":"V. F."},null,{"$f":"B82","v":"LEO LIMA (SP)"}]
["P. F.",{"$f":"IF($K$75=2,$B$75,$B$76)","v":"DANIEL COUTO (RJ)"},{"$f":"VLOOKUP($B83,$B$68:$K$71,2,FALSE)+VLOOKUP($B83,$B$75:$K$78,2,FALSE)","v":46},{"$f":"VLOOKUP($B83,$B$68:$K$71,3,FALSE)+VLOOKUP($B83,$B$75:$K$78,3,FALSE)","v":18},{"$f":"VLOOKUP($B83,$B$68:$K$71,4,FALSE)+VLOOKUP($B83,$B$75:$K$78,4,FALSE)","v":15},{"$f":"VLOOKUP($B83,$B$68:$K$71,5,FALSE)+VLOOKUP($B83,$B$75:$K$78,5,FALSE)","v":1},{"$f":"VLOOKUP($B83,$B$68:$K$71,6,FALSE)+VLOOKUP($B83,$B$75:$K$78,6,FALSE)","v":2},{"$f":"VLOOKUP($B83,$B$68:$K$71,7,FALSE)+VLOOKUP($B83,$B$75:$K$78,7,FALSE)","v":94},{"$f":"VLOOKUP($B83,$B$68:$K$71,8,FALSE)+VLOOKUP($B83,$B$75:$K$78,8,FALSE)","v":47},{"$f":"VLOOKUP($B83,$B$68:$K$71,9,FALSE)+VLOOKUP($B83,$B$75:$K$78,9,FALSE)","v":47},2,{"$f":"(C83*1000000000)+(E83*1000000)+(J83*1000)+H83","v":46015047094},{"$f":"VLOOKUP(B83,$B$3:$M$18,12,FALSE)","v":2},{"$f":"RANK(L83,$L$82:$L$83)","v":2},{"$f":"A83","v":"P. F."},null,{"$f":"B83","v":"DANIEL COUTO (RJ)"}]
["V. F.",{"$f":"IF($K$77=3,$B$77,$B$78)","v":"RODRIGO (PE)"},34,18,11,1,6,124,113,11,{"$f":"VLOOKUP($B84,$B$75:$K$78,10,FALSE)","v":3},{"$f":"(C84*1000000000)+(E84*1000000)+(J84*1000)+H84","v":34011011124},{"$f":"VLOOKUP(B84,$B$3:$M$18,12,FALSE)","v":4},{"$f":"RANK(L84,$L$84:$L$85)","v":2},{"$f":"A84","v":"V. F."},null,{"$f":"B84","v":"RODRIGO (PE)"}]
["P. F.",{"$f":"IF($K$77=4,$B$77,$B$78)","v":"WALLACE RINCO (SP)"},43,18,14,1,3,88,47,41,4,43014041088,{"$f":"VLOOKUP(B85,$B$3:$M$18,12,FALSE)","v":3},{"$f":"RANK(L85,$L$84:$L$85)","v":1},{"$f":"A85","v":"P. F."},null,{"$f":"B85","v":"WALLACE RINCO (SP)"}]
[]
["Resumo Geral Acumulado até as Finais"]
["Ref.","Atletas","PG","J","V","E","D","GP","GC","SG","Class","Chave","Key","Rank"]
[{"$f":"VLOOKUP(N89,$N$82:$Q$83,2,FALSE)","v":"V. F."},{"$f":"VLOOKUP(N89,$N$82:$Q$83,4,FALSE)","v":"LEO LIMA (SP)"},{"$f":"VLOOKUP($B89,$B$82:$M$85,2,FALSE)","v":52},{"$f":"VLOOKUP($B89,$B$82:$M$85,3,FALSE)","v":18},{"$f":"VLOOKUP($B89,$B$82:$M$85,4,FALSE)","v":17},{"$f":"VLOOKUP($B89,$B$82:$M$85,5,FALSE)","v":1},{"$f":"VLOOKUP($B89,$B$82:$M$85,6,FALSE)","v":0},{"$f":"VLOOKUP($B89,$B$82:$M$85,7,FALSE)","v":134},{"$f":"VLOOKUP($B89,$B$82:$M$85,8,FALSE)","v":37},{"$f":"VLOOKUP($B89,$B$82:$M$85,9,FALSE)","v":97},{"$f":"VLOOKUP($B89,$B$82:$M$85,10,FALSE)","v":1},{"$f":"(C89*1000000000)+(E89*1000000)+(J89*1000)+H89","v":52017097134},{"$f":"VLOOKUP(B89,$B$3:$M$18,12,FALSE)","v":1},1,{"$f":"B89","v":"LEO LIMA (SP)"}]
[{"$f":"VLOOKUP(N90,$N$82:$Q$83,2,FALSE)","v":"P. F."},{"$f":"VLOOKUP(N90,$N$82:$Q$83,4,FALSE)","v":"DANIEL COUTO (RJ)"},{"$f":"VLOOKUP($B90,$B$82:$M$85,2,FALSE)","v":46},{"$f":"VLOOKUP($B90,$B$82:$M$85,3,FALSE)","v":18},{"$f":"VLOOKUP($B90,$B$82:$M$85,4,FALSE)","v":15},{"$f":"VLOOKUP($B90,$B$82:$M$85,5,FALSE)","v":1},{"$f":"VLOOKUP($B90,$B$82:$M$85,6,FALSE)","v":2},{"$f":"VLOOKUP($B90,$B$82:$M$85,7,FALSE)","v":94},{"$f":"VLOOKUP($B90,$B$82:$M$85,8,FALSE)","v":47},{"$f":"VLOOKUP($B90,$B$82:$M$85,9,FALSE)","v":47},{"$f":"VLOOKUP($B90,$B$82:$M$85,10,FALSE)","v":2},{"$f":"(C90*1000000000)+(E90*1000000)+(J90*1000)+H90","v":46015047094},{"$f":"VLOOKUP(B90,$B$3:$M$18,12,FALSE)","v":2},2,{"$f":"B90","v":"DANIEL COUTO (RJ)"}]
[{"$f":"VLOOKUP(N91,$N$84:$Q$85,2,FALSE)","v":"P. F."},{"$f":"VLOOKUP(N91,$N$84:$Q$85,4,FALSE)","v":"WALLACE RINCO (SP)"},{"$f":"VLOOKUP($B91,$B$82:$M$85,2,FALSE)","v":43},{"$f":"VLOOKUP($B91,$B$82:$M$85,3,FALSE)","v":18},{"$f":"VLOOKUP($B91,$B$82:$M$85,4,FALSE)","v":14},{"$f":"VLOOKUP($B91,$B$82:$M$85,5,FALSE)","v":1},{"$f":"VLOOKUP($B91,$B$82:$M$85,6,FALSE)","v":3},{"$f":"VLOOKUP($B91,$B$82:$M$85,7,FALSE)","v":88},{"$f":"VLOOKUP($B91,$B$82:$M$85,8,FALSE)","v":47},{"$f":"VLOOKUP($B91,$B$82:$M$85,9,FALSE)","v":41},{"$f":"VLOOKUP($B91,$B$82:$M$85,10,FALSE)","v":4},{"$f":"(C91*1000000000)+(E91*1000000)+(J91*1000)+H91","v":43014041088},{"$f":"VLOOKUP(B91,$B$3:$M$18,12,FALSE)","v":3},1,{"$f":"B91","v":"WALLACE RINCO (SP)"}]
[{"$f":"VLOOKUP(N92,$N$82:$Q$83,2,FALSE)","v":"P. F."},{"$f":"VLOOKUP(N92,$N$84:$Q$85,4,FALSE)","v":"RODRIGO (PE)"},{"$f":"VLOOKUP($B92,$B$82:$M$85,2,FALSE)","v":34},{"$f":"VLOOKUP($B92,$B$82:$M$85,3,FALSE)","v":18},{"$f":"VLOOKUP($B92,$B$82:$M$85,4,FALSE)","v":11},{"$f":"VLOOKUP($B92,$B$82:$M$85,5,FALSE)","v":1},{"$f":"VLOOKUP($B92,$B$82:$M$85,6,FALSE)","v":6},{"$f":"VLOOKUP($B92,$B$82:$M$85,7,FALSE)","v":124},{"$f":"VLOOKUP($B92,$B$82:$M$85,8,FALSE)","v":113},{"$f":"VLOOKUP($B92,$B$82:$M$85,9,FALSE)","v":11},{"$f":"VLOOKUP($B92,$B$82:$M$85,10,FALSE)","v":3},{"$f":"(C92*1000000000)+(E92*1000000)+(J92*1000)+H92","v":34011011124},{"$f":"VLOOKUP(B92,$B$3:$M$18,12,FALSE)","v":4},2,{"$f":"B92","v":"RODRIGO (PE)"}]
[]
["Resumo para Classificação Final"]
["Class","Atletas","PG","J","V","E","D","GP","GC","SG","Class","Chave","Key"]
[{"$f":"K96","v":1},{"$f":"B89","v":"LEO LIMA (SP)"},{"$f":"C89","v":52},18,17,1,0,134,37,97,1,52017097134,1]
[{"$f":"K97","v":2},{"$f":"B90","v":"DANIEL COUTO (RJ)"},46,18,15,1,2,94,47,47,{"$f":"K90","v":2},46015047094,2]
[{"$f":"K98","v":4},{"$f":"B63","v":"RODRIGO (PE)"},31,17,10,1,6,119,110,9,{"$f":"K91","v":4},{"$f":"L63","v":31010009119},{"$f":"M63","v":4}]
[{"$f":"K99","v":3},{"$f":"B64","v":"WALLACE RINCO (SP)"},43,17,14,1,2,85,42,43,{"$f":"K92","v":3},{"$f":"L64","v":43014043085},{"$f":"M64","v":3}]
[{"$f":"RANK(L100,$L$100:$L$103,0)+K100-1","v":8},{"$f":"B40","v":"LUIZ GULHERME (SP)"},{"$f":"C40","v":20},{"$f":"D40","v":16},6,2,8,44,49,-5,5,20005995044,8]
[{"$f":"RANK(L101,$L$100:$L$103,0)+K101-1","v":7},{"$f":"B41","v":"TUSURINHA (SP)"},21,16,7,0,9,33,56,-23,5,21006977033,7]
[6,"IGOR COSTA (SP)",24,16,8,0,8,40,48,-8,5,24007992040,6]
[5,"MELLI JR (SP)",28,16,9,1,6,88,91,-3,5,28008997088,5]
[{"$f":"RANK(L104,$L$104:$L$111,0)+K104-1","v":9},{"$f":"B11","v":"VITOR HUGO (SP)"},{"$f":"C11","v":19},{"$f":"D11","v":15},5,4,6,35,41,-6,9,19004994035,9]
[{"$f":"RANK(L105,$L$104:$L$111,0)+K105-1","v":10},{"$f":"B12","v":"PEDRO ANTONIO (SP)"},18,{"$f":"D12","v":15},5,3,7,38,45,-7,9,18004993038,10]
[11,"TUGUINHA (SP)",17,{"$f":"D13","v":15},5,2,8,31,54,-23,9,17004977031,11]
[12,"LINNO BALA (PE)",15,{"$f":"D14","v":15},4,3,8,31,52,-21,9,15003979031,12]
[13,"PEDRINHO (SP)",14,{"$f":"D15","v":15},3,5,7,31,40,-9,9,14002991031,13]
[14,"VERISSON (PE)",10,{"$f":"D16","v":15},3,1,11,22,50,-28,9,10002972022,14]
[15,"DAVI ANDRADE (SP)",7,{"$f":"D17","v":15},2,1,12,14,43,-29,9,7001971014,15]
[16,"CAROL (SP)",3,{"$f":"D18","v":15},1,0,14,18,52,-34,9,3000966018,16]
[]
["Classificação Final"]
["Class","Atletas","PG","J","V","E","D","GP","GC","SG","Class","Chave","Key"]
[1,{"$f":"VLOOKUP($A115,$A$96:$M$111,2,0)","v":"LEO LIMA (SP)"},{"$f":"VLOOKUP($A115,$A$96:$M$111,3,0)","v":52},{"$f":"VLOOKUP($A115,$A$96:$M$111,4,0)","v":18},{"$f":"VLOOKUP($A115,$A$96:$M$111,5,0)","v":17},{"$f":"VLOOKUP($A115,$A$96:$M$111,6,0)","v":1},{"$f":"VLOOKUP($A115,$A$96:$M$111,7,0)","v":0},{"$f":"VLOOKUP($A115,$A$96:$M$111,8,0)","v":134},{"$f":"VLOOKUP($A115,$A$96:$M$111,9,0)","v":37},{"$f":"VLOOKUP($A115,$A$96:$M$111,10,0)","v":97},{"$f":"VLOOKUP($A115,$A$96:$M$111,11,0)","v":1},{"$f":"VLOOKUP($A115,$A$96:$M$111,12,0)","v":52017097134},{"$f":"VLOOKUP($A115,$A$96:$M$111,13,0)","v":1}]
[2,{"$f":"VLOOKUP($A116,$A$96:$M$111,2,0)","v":"DANIEL COUTO (RJ)"},{"$f":"VLOOKUP($A116,$A$96:$M$111,3,0)","v":46},{"$f":"VLOOKUP($A116,$A$96:$M$111,4,0)","v":18},{"$f":"VLOOKUP($A116,$A$96:$M$111,5,0)","v":15},{"$f":"VLOOKUP($A116,$A$96:$M$111,6,0)","v":1},{"$f":"VLOOKUP($A116,$A$96:$M$111,7,0)","v":2},{"$f":"VLOOKUP($A116,$A$96:$M$111,8,0)","v":94},{"$f":"VLOOKUP($A116,$A$96:$M$111,9,0)","v":47},{"$f":"VLOOKUP($A116,$A$96:$M$111,10,0)","v":47},{"$f":"VLOOKUP($A116,$A$96:$M$111,11,0)","v":2},{"$f":"VLOOKUP($A116,$A$96:$M$111,12,0)","v":46015047094},{"$f":"VLOOKUP($A116,$A$96:$M$111,13,0)","v":2}]
[3,"WALLACE RINCO (SP)",43,17,14,1,2,85,42,43,3,43014043085,3]
[4,"RODRIGO (PE)",31,17,10,1,6,119,110,9,4,31010009119,4]
[5,"MELLI JR (SP)",28,16,9,1,6,88,91,-3,5,28008997088,5]
[6,"IGOR COSTA (SP)",24,16,8,0,8,40,48,-8,5,24007992040,6]
[7,"TUSURINHA (SP)",21,16,7,0,9,33,56,-23,5,21006977033,7]
[8,"LUIZ GULHERME (SP)",20,16,6,2,8,44,49,-5,5,20005995044,8]
[9,"VITOR HUGO (SP)",19,15,5,4,6,35,41,-6,9,19004994035,9]
[10,"PEDRO ANTONIO (SP)",18,15,5,3,7,38,45,-7,9,18004993038,10]
[11,"TUGUINHA (SP)",17,15,5,2,8,31,54,-23,9,17004977031,11]
[12,"LINNO BALA (PE)",15,15,4,3,8,31,52,-21,9,15003979031,12]
[13,"PEDRINHO (SP)",14,15,3,5,7,31,40,-9,9,14002991031,13]
[14,"VERISSON (PE)",10,15,3,1,11,22,50,-28,9,10002972022,14]
[15,"DAVI ANDRADE (SP)",7,15,2,1,12,14,43,-29,9,7001971014,15]
[16,"CAROL (SP)",3,15,1,0,14,18,52,-34,9,3000966018,16]

{"sheet":"SUM-F1","index":9,"n_rows":958,"n_cols":33,"rows_kept":958,"cut":false,"hidden":false,"merged":[[953,2,954,2],[953,14,954,14],[954,4,955,8],[954,16,955,20],[955,10,957,10],[955,22,957,22],[957,2,958,2],[957,14,958,14],[948,4,949,8],[948,16,949,20],[949,2,950,2],[949,10,951,10],[949,14,950,14],[949,22,951,22],[937,2,938,2],[937,14,938,14],[938,4,939,8],[938,16,939,20],[939,10,941,10],[939,22,941,22],[941,2,942,2],[941,14,942,14],[932,4,933,8],[932,16,933,20],[933,2,934,2],[933,10,935,10],[933,14,934,14],[933,22,935,22],[921,2,922,2],[921,14,922,14],[922,4,923,8],[922,16,923,20],[923,10,925,10],[923,22,925,22],[925,2,926,2],[925,14,926,14],[916,4,917,8],[916,16,917,20],[917,2,918,2],[917,10,919,10],[917,14,918,14],[917,22,919,22],[905,2,906,2],[905,14,906,14],[906,4,907,8],[906,16,907,20],[907,10,909,10],[907,22,909,22],[909,2,910,2],[909,14,910,14],[900,4,901,8],[900,16,901,20],[901,2,902,2],[901,10,903,10],[901,14,902,14],[901,22,903,22],[889,2,890,2],[889,14,890,14],[890,4,891,8],[890,16,891,20],[891,10,893,10],[891,22,893,22],[893,2,894,2],[893,14,894,14],[884,4,885,8],[884,16,885,20],[885,2,886,2],[885,10,887,10],[885,14,886,14],[885,22,887,22],[873,2,874,2],[873,14,874,14],[874,4,875,8],[874,16,875,20],[875,10,877,10],[875,22,877,22],[877,2,878,2],[877,14,878,14],[868,4,869,8],[868,16,869,20],[869,2,870,2],[869,10,871,10],[869,14,870,14],[869,22,871,22],[857,2,858,2],[857,14,858,14],[858,4,859,8],[858,16,859,20],[859,10,861,10],[859,22,861,22],[861,2,862,2],[861,14,862,14],[852,4,853,8],[852,16,853,20],[853,2,854,2],[853,10,855,10],[853,14,854,14],[853,22,855,22],[841,2,842,2],[841,14,842,14],[842,4,843,8],[842,16,843,20],[843,10,845,10],[843,22,845,22],[845,2,846,2],[845,14,846,14],[836,4,837,8],[836,16,837,20],[837,2,838,2],[837,10,839,10],[837,14,838,14],[837,22,839,22],[825,2,826,2],[825,14,826,14],[826,4,827,8],[826,16,827,20],[827,10,829,10],[827,22,829,22],[829,2,830,2],[829,14,830,14],[820,4,821,8],[820,16,821,20],[821,2,822,2],[821,10,823,10],[821,14,822,14],[821,22,823,22],[809,2,810,2],[809,14,810,14],[810,4,811,8],[810,16,811,20],[811,10,813,10],[811,22,813,22],[813,2,814,2],[813,14,814,14],[804,4,805,8],[804,16,805,20],[805,2,806,2],[805,10,807,10],[805,14,806,14],[805,22,807,22],[793,2,794,2],[793,14,794,14],[794,4,795,8],[794,16,795,20],[795,10,797,10],[795,22,797,22],[797,2,798,2],[797,14,798,14],[788,4,789,8],[788,16,789,20],[789,2,790,2],[789,10,791,10],[789,14,790,14],[789,22,791,22],[777,2,778,2],[777,14,778,14],[778,4,779,8],[778,16,779,20],[779,10,781,10],[779,22,781,22],[781,2,782,2],[781,14,782,14],[772,4,773,8],[772,16,773,20],[773,2,774,2],[773,10,775,10],[773,14,774,14],[773,22,775,22],[761,2,762,2],[761,14,762,14],[762,4,763,8],[762,16,763,20],[763,10,765,10],[763,22,765,22],[765,2,766,2],[765,14,766,14],[756,4,757,8],[756,16,757,20],[757,2,758,2],[757,10,759,10],[757,14,758,14],[757,22,759,22],[745,2,746,2],[745,14,746,14],[746,4,747,8],[746,16,747,20],[747,10,749,10],[747,22,749,22],[749,2,750,2],[749,14,750,14],[740,4,741,8],[740,16,741,20],[741,2,742,2],[741,10,743,10],[741,14,742,14],[741,22,743,22],[729,2,730,2],[729,14,730,14],[730,4,731,8],[730,16,731,20],[731,10,733,10],[731,22,733,22],[733,2,734,2],[733,14,734,14],[724,4,725,8],[724,16,725,20],[725,2,726,2],[725,10,727,10],[725,14,726,14],[725,22,727,22],[713,2,714,2],[713,14,714,14],[714,4,715,8],[714,16,715,20],[715,10,717,10],[715,22,717,22],[717,2,718,2],[717,14,718,14],[708,4,709,8],[708,16,709,20],[709,2,710,2],[709,10,711,10],[709,14,710,14],[709,22,711,22],[697,2,698,2],[697,14,698,14],[698,4,699,8],[698,16,699,20],[699,10,701,10],[699,22,701,22],[701,2,702,2],[701,14,702,14],[692,4,693,8],[692,16,693,20],[693,2,694,2],[693,10,695,10],[693,14,694,14],[693,22,695,22],[681,2,682,2],[681,14,682,14],[682,4,683,8],[682,16,683,20],[683,10,685,10],[683,22,685,22],[685,2,686,2],[685,14,686,14],[676,4,677,8],[676,16,677,20],[677,2,678,2],[677,10,679,10],[677,14,678,14],[677,22,679,22],[665,2,666,2],[665,14,666,14],[666,4,667,8],[666,16,667,20],[667,10,669,10],[667,22,669,22],[669,2,670,2],[669,14,670,14],[660,4,661,8],[660,16,661,20],[661,2,662,2],[661,10,663,10],[661,14,662,14],[661,22,663,22],[649,2,650,2],[649,14,650,14],[650,4,651,8],[650,16,651,20],[651,10,653,10],[651,22,653,22],[653,2,654,2],[653,14,654,14],[644,4,645,8],[644,16,645,20],[645,2,646,2],[645,10,647,10],[645,14,646,14],[645,22,647,22],[633,2,634,2],[633,14,634,14],[634,4,635,8],[634,16,635,20],[635,10,637,10],[635,22,637,22],[637,2,638,2],[637,14,638,14],[628,4,629,8],[628,16,629,20],[629,2,630,2],[629,10,631,10],[629,14,630,14],[629,22,631,22],[617,2,618,2],[617,14,618,14],[618,4,619,8],[618,16,619,20],[619,10,621,10],[619,22,621,22],[621,2,622,2],[621,14,622,14],[612,4,613,8],[612,16,613,20],[613,2,614,2],[613,10,615,10],[613,14,614,14],[613,22,615,22],[601,2,602,2],[601,14,602,14],[602,4,603,8],[602,16,603,20],[603,10,605,10],[603,22,605,22],[605,2,606,2],[605,14,606,14],[596,4,597,8],[596,16,597,20],[597,2,598,2],[597,10,599,10],[597,14,598,14],[597,22,599,22],[585,2,586,2],[585,14,586,14],[586,4,587,8],[586,16,587,20],[587,10,589,10],[587,22,589,22],[589,2,590,2],[589,14,590,14],[580,4,581,8],[580,16,581,20],[581,2,582,2],[581,10,583,10],[581,14,582,14],[581,22,583,22],[569,2,570,2],[569,14,570,14],[570,4,571,8],[570,16,571,20],[571,10,573,10],[571,22,573,22],[573,2,574,2],[573,14,574,14],[564,4,565,8],[564,16,565,20],[565,2,566,2],[565,10,567,10],[565,14,566,14],[565,22,567,22],[553,2,554,2],[553,14,554,14],[554,4,555,8],[554,16,555,20],[555,10,557,10],[555,22,557,22],[557,2,558,2],[557,14,558,14],[548,4,549,8],[548,16,549,20],[549,2,550,2],[549,10,551,10],[549,14,550,14],[549,22,551,22],[537,2,538,2],[537,14,538,14],[538,4,539,8],[538,16,539,20],[539,10,541,10],[539,22,541,22],[541,2,542,2],[541,14,542,14],[532,4,533,8],[532,16,533,20],[533,2,534,2],[533,10,535,10],[533,14,534,14],[533,22,535,22],[521,2,522,2],[521,14,522,14],[522,4,523,8],[522,16,523,20],[523,10,525,10],[523,22,525,22],[525,2,526,2],[525,14,526,14],[516,4,517,8],[516,16,517,20],[517,2,518,2],[517,10,519,10],[517,14,518,14],[517,22,519,22],[505,2,506,2],[505,14,506,14],[506,4,507,8],[506,16,507,20],[507,10,509,10],[507,22,509,22],[509,2,510,2],[509,14,510,14],[500,4,501,8],[500,16,501,20],[501,2,502,2],[501,10,503,10],[501,14,502,14],[501,22,503,22],[489,2,490,2],[489,14,490,14],[490,4,491,8],[490,16,491,20],[491,10,493,10],[491,22,493,22],[493,2,494,2],[493,14,494,14],[484,4,485,8],[484,16,485,20],[485,2,486,2],[485,10,487,10],[485,14,486,14],[485,22,487,22],[473,2,474,2],[473,14,474,14],[474,4,475,8],[474,16,475,20],[475,10,477,10],[475,22,477,22],[477,2,478,2],[477,14,478,14],[468,4,469,8],[468,16,469,20],[469,2,470,2],[469,10,471,10],[469,14,470,14],[469,22,471,22],[457,2,458,2],[457,14,458,14],[458,4,459,8],[458,16,459,20],[459,10,461,10],[459,22,461,22],[461,2,462,2],[461,14,462,14],[452,4,453,8],[452,16,453,20],[453,2,454,2],[453,10,455,10],[453,14,454,14],[453,22,455,22],[441,2,442,2],[441,14,442,14],[442,4,443,8],[442,16,443,20],[443,10,445,10],[443,22,445,22],[445,2,446,2],[445,14,446,14],[436,4,437,8],[436,16,437,20],[437,2,438,2],[437,10,439,10],[437,14,438,14],[437,22,439,22],[425,2,426,2],[425,14,426,14],[426,4,427,8],[426,16,427,20],[427,10,429,10],[427,22,429,22],[429,2,430,2],[429,14,430,14],[420,4,421,8],[420,16,421,20],[421,2,422,2],[421,10,423,10],[421,14,422,14],[421,22,423,22],[409,2,410,2],[409,14,410,14],[410,4,411,8],[410,16,411,20],[411,10,413,10],[411,22,413,22],[413,2,414,2],[413,14,414,14],[404,4,405,8],[404,16,405,20],[405,2,406,2],[405,10,407,10],[405,14,406,14],[405,22,407,22],[393,2,394,2],[393,14,394,14],[394,4,395,8],[394,16,395,20],[395,10,397,10],[395,22,397,22],[397,2,398,2],[397,14,398,14],[388,4,389,8],[388,16,389,20],[389,2,390,2],[389,10,391,10],[389,14,390,14],[389,22,391,22],[377,2,378,2],[377,14,378,14],[378,4,379,8],[378,16,379,20],[379,10,381,10],[379,22,381,22],[381,2,382,2],[381,14,382,14],[372,4,373,8],[372,16,373,20],[373,2,374,2],[373,10,375,10],[373,14,374,14],[373,22,375,22],[361,2,362,2],[361,14,362,14],[362,4,363,8],[362,16,363,20],[363,10,365,10],[363,22,365,22],[365,2,366,2],[365,14,366,14],[356,4,357,8],[356,16,357,20],[357,2,358,2],[357,10,359,10],[357,14,358,14],[357,22,359,22],[345,2,346,2],[345,14,346,14],[346,4,347,8],[346,16,347,20],[347,10,349,10],[347,22,349,22],[349,2,350,2],[349,14,350,14],[340,4,341,8],[340,16,341,20],[341,2,342,2],[341,10,343,10],[341,14,342,14],[341,22,343,22],[329,2,330,2],[329,14,330,14],[330,4,331,8],[330,16,331,20],[331,10,333,10],[331,22,333,22],[333,2,334,2],[333,14,334,14],[324,4,325,8],[324,16,325,20],[325,2,326,2],[325,10,327,10],[325,14,326,14],[325,22,327,22],[313,2,314,2],[313,14,314,14],[314,4,315,8],[314,16,315,20],[315,10,317,10],[315,22,317,22],[317,2,318,2],[317,14,318,14],[308,4,309,8],[308,16,309,20],[309,2,310,2],[309,10,311,10],[309,14,310,14],[309,22,311,22],[297,2,298,2],[297,14,298,14],[298,4,299,8],[298,16,299,20],[299,10,301,10],[299,22,301,22],[301,2,302,2],[301,14,302,14],[292,4,293,8],[292,16,293,20],[293,2,294,2],[293,10,295,10],[293,14,294,14],[293,22,295,22],[281,2,282,2],[281,14,282,14],[282,4,283,8],[282,16,283,20],[283,10,285,10],[283,22,285,22],[285,2,286,2],[285,14,286,14],[276,4,277,8],[276,16,277,20],[277,2,278,2],[277,10,279,10],[277,14,278,14],[277,22,279,22],[265,2,266,2],[265,14,266,14],[266,4,267,8],[266,16,267,20],[267,10,269,10],[267,22,269,22],[269,2,270,2],[269,14,270,14],[260,4,261,8],[260,16,261,20],[261,2,262,2],[261,10,263,10],[261,14,262,14],[261,22,263,22],[249,2,250,2],[249,14,250,14],[250,4,251,8],[250,16,251,20],[251,10,253,10],[251,22,253,22],[253,2,254,2],[253,14,254,14],[244,4,245,8],[244,16,245,20],[245,2,246,2],[245,10,247,10],[245,14,246,14],[245,22,247,22],[233,2,234,2],[233,14,234,14],[234,4,235,8],[234,16,235,20],[235,10,237,10],[235,22,237,22],[237,2,238,2],[237,14,238,14],[228,4,229,8],[228,16,229,20],[229,2,230,2],[229,10,231,10],[229,14,230,14],[229,22,231,22],[217,2,218,2],[217,14,218,14],[218,4,219,8],[218,16,219,20],[219,10,221,10],[219,22,221,22],[221,2,222,2],[221,14,222,14],[212,4,213,8],[212,16,213,20],[213,2,214,2],[213,10,215,10],[213,14,214,14],[213,22,215,22],[201,2,202,2],[201,14,202,14],[202,4,203,8],[202,16,203,20],[203,10,205,10],[203,22,205,22],[205,2,206,2],[205,14,206,14],[196,4,197,8],[196,16,197,20],[197,2,198,2],[197,10,199,10],[197,14,198,14],[197,22,199,22],[185,2,186,2],[185,14,186,14],[186,4,187,8],[186,16,187,20],[187,10,189,10],[187,22,189,22],[189,2,190,2],[189,14,190,14],[180,4,181,8],[180,16,181,20],[181,2,182,2],[181,10,183,10],[181,14,182,14],[181,22,183,22],[169,2,170,2],[169,14,170,14],[170,4,171,8],[170,16,171,20],[171,10,173,10],[171,22,173,22],[173,2,174,2],[173,14,174,14],[164,4,165,8],[164,16,165,20],[165,2,166,2],[165,10,167,10],[165,14,166,14],[165,22,167,22],[153,2,154,2],[153,14,154,14],[154,4,155,8],[154,16,155,20],[155,10,157,10],[155,22,157,22],[157,2,158,2],[157,14,158,14],[148,4,149,8],[148,16,149,20],[149,2,150,2],[149,10,151,10],[149,14,150,14],[149,22,151,22],[137,2,138,2],[137,14,138,14],[138,4,139,8],[138,16,139,20],[139,10,141,10],[139,22,141,22],[141,2,142,2],[141,14,142,14],[132,4,133,8],[132,16,133,20],[133,2,134,2],[133,10,135,10],[133,14,134,14],[133,22,135,22],[121,2,122,2],[121,14,122,14],[122,4,123,8],[122,16,123,20],[123,10,125,10],[123,22,125,22],[125,2,126,2],[125,14,126,14],[116,4,117,8],[116,16,117,20],[117,2,118,2],[117,10,119,10],[117,14,118,14],[117,22,119,22],[105,2,106,2],[105,14,106,14],[106,4,107,8],[106,16,107,20],[107,10,109,10],[107,22,109,22],[109,2,110,2],[109,14,110,14],[100,4,101,8],[100,16,101,20],[101,2,102,2],[101,10,103,10],[101,14,102,14],[101,22,103,22],[89,2,90,2],[89,14,90,14],[90,4,91,8],[90,16,91,20],[91,10,93,10],[91,22,93,22],[93,2,94,2],[93,14,94,14],[84,4,85,8],[84,16,85,20],[85,2,86,2],[85,10,87,10],[85,14,86,14],[85,22,87,22],[73,2,74,2],[73,14,74,14],[74,4,75,8],[74,16,75,20],[75,10,77,10],[75,22,77,22],[77,2,78,2],[77,14,78,14],[68,4,69,8],[68,16,69,20],[69,2,70,2],[69,10,71,10],[69,14,70,14],[69,22,71,22],[57,2,58,2],[57,14,58,14],[58,4,59,8],[58,16,59,20],[59,10,61,10],[59,22,61,22],[61,2,62,2],[61,14,62,14],[52,4,53,8],[52,16,53,20],[53,2,54,2],[53,10,55,10],[53,14,54,14],[53,22,55,22],[41,2,42,2],[41,14,42,14],[42,4,43,8],[42,16,43,20],[43,10,45,10],[43,22,45,22],[45,2,46,2],[45,14,46,14],[36,4,37,8],[36,16,37,20],[37,2,38,2],[37,10,39,10],[37,14,38,14],[37,22,39,22],[25,2,26,2],[25,14,26,14],[26,4,27,8],[26,16,27,20],[27,10,29,10],[27,22,29,22],[29,2,30,2],[29,14,30,14],[20,4,21,8],[20,16,21,20],[21,2,22,2],[21,10,23,10],[21,14,22,14],[21,22,23,22],[9,2,10,2],[9,14,10,14],[10,4,11,8],[10,16,11,20],[11,10,13,10],[11,22,13,22],[13,2,14,2],[13,14,14,14],[4,4,5,8],[4,16,5,20],[5,2,6,2],[5,10,7,10],[5,14,6,14],[5,22,7,22]]}
[null,null,null,null,null,null,null,null,null,null,null,null,null,null,null,null,null,null,null,null,null,null,null,null,null,"N.o","32º Campeonato Brasileiro Individual","Categoria","Grp","Rod","Mesa","Jog1","Jog2"]
[null,null,{"$f":"$AA$1","v":"32º Campeonato Brasileiro Individual"},null,null,null,null,null,null,null,{"$f":"$AB$1","v":"Categoria"},null,null,null,{"$f":"$AA$1","v":"32º Campeonato Brasileiro Individual"},null,null,null,null,null,null,null,{"$f":"$AB$1","v":"Categoria"},null,null,1,"1a Fase","SUB-18",1,1,{"$f":"'F1'!D9","v":57},{"$f":"'F1'!E9","v":"LEO LIMA (SP)"},{"$f":"'F1'!L9","v":"CAROL (SP)"}]
[null,null,{"$f":"$AA$2","v":"1a Fase"},null,null,null,null,null,null,null,{"$f":"$AB$2","v":"SUB-18"},null,null,null,{"$f":"$AA$3","v":"1a Fase"},null,null,null,null,null,null,null,{"$f":"$AB$3","v":"SUB-18"},null,null,2,{"$f":"AA2","v":"1a Fase"},{"$f":"AB2","v":"SUB-18"},1,1,{"$f":"'F1'!D10","v":58},{"$f":"'F1'!E10","v":"PEDRO ANTONIO (SP)"},{"$f":"'F1'!L10","v":"TUGUINHA (SP)"}]
[null,null,null,null,null,null,null,null,null,null,null,null,null,null,null,null,null,null,null,null,null,null,null,null,null,3,"1a Fase","SUB-18",1,1,{"$f":"'F1'!D11","v":59},{"$f":"'F1'!E11","v":"IGOR COSTA (SP)"},{"$f":"'F1'!L11","v":"LUIZ GULHERME (SP)"}]
[1,null,"Grupo",null,{"$f":"$AF$2","v":"LEO LIMA (SP)"},null,null,null,null,null,null,null,null,null,"Grupo",null,{"$f":"$AF$3","v":"PEDRO ANTONIO (SP)"},null,null,null,null,null,null,null,null,4,"1a Fase","SUB-18",1,1,{"$f":"'F1'!D12","v":60},{"$f":"'F1'!E12","v":"VITOR HUGO (SP)"},{"$f":"'F1'!L12","v":"TUSURINHA (SP)"}]
[1,null,{"$f":"$AC$2","v":1},null,null,null,null,null,null,null,null,null,null,null,{"$f":"$AC$3","v":1},null,null,null,null,null,null,null,null,null,null,5,"1a Fase","SUB-18",1,1,{"$f":"'F1'!D13","v":61},{"$f":"'F1'!E13","v":"PEDRINHO (SP)"},{"$f":"'F1'!L13","v":"MELLI JR (SP)"}]
[null,null,null,null,null,null,null,null,null,null,null,null,null,null,null,null,null,null,null,null,null,null,null,null,null,6,"1a Fase","SUB-18",1,1,{"$f":"'F1'!D14","v":62},{"$f":"'F1'!E14","v":"WALLACE RINCO (SP)"},{"$f":"'F1'!L14","v":"DAVI ANDRADE (SP)"}]
[null,null,null,null,null,null,null,null,null,null,null,null,null,null,null,null,null,null,null,null,null,null,null,null,null,7,"1a Fase","SUB-18",1,1,{"$f":"'F1'!D15","v":63},{"$f":"'F1'!E15","v":"RODRIGO (PE)"},{"$f":"'F1'!L15","v":"VERISSON (PE)"}]
[null,null,"Rodada",null,null,null,null,null,null,null,null,null,null,null,"Rodada",null,null,null,null,null,null,null,null,null,null,8,"1a Fase","SUB-18",1,1,{"$f":"'F1'!D16","v":64},{"$f":"'F1'!E16","v":"LINNO BALA (PE)"},{"$f":"'F1'!L16","v":"DANIEL COUTO (RJ)"}]
[null,null,{"$f":"$AD$2","v":1},null,null,null,null,null,null,null,null,null,null,null,{"$f":"$AD$3","v":1},null,null,null,null,null,null,null,null,null,null,9,"1a Fase","SUB-18",1,2,{"$f":"'F1'!D18","v":60},{"$f":"'F1'!E18","v":"LEO LIMA (SP)"},{"$f":"'F1'!L18","v":"TUGUINHA (SP)"}]
[1,null,null,null,{"$f":"$AG$2","v":"CAROL (SP)"},null,null,null,null,null,null,null,null,null,null,null,{"$f":"$AG$3","v":"TUGUINHA (SP)"},null,null,null,null,null,null,null,null,10,"1a Fase","SUB-18",1,2,{"$f":"'F1'!D19","v":59},{"$f":"'F1'!E19","v":"PEDRO ANTONIO (SP)"},{"$f":"'F1'!L19","v":"CAROL (SP)"}]
[1,null,null,null,null,null,null,null,null,null,null,null,null,null,null,null,null,null,null,null,null,null,null,null,null,11,"1a Fase","SUB-18",1,2,{"$f":"'F1'!D20","v":62},{"$f":"'F1'!E20","v":"IGOR COSTA (SP)"},{"$f":"'F1'!L20","v":"TUSURINHA (SP)"}]
[null,null,"Mesa",null,null,null,null,null,null,null,null,null,null,null,"Mesa",null,null,null,null,null,null,null,null,null,null,12,"1a Fase","SUB-18",1,2,{"$f":"'F1'!D21","v":61},{"$f":"'F1'!E21","v":"VITOR HUGO (SP)"},{"$f":"'F1'!L21","v":"LUIZ GULHERME (SP)"}]
[null,null,{"$f":"$AE$2","v":57},null,null,null,null,null,null,null,null,null,null,null,{"$f":"$AE$3","v":58},null,null,null,null,null,null,null,null,null,null,13,"1a Fase","SUB-18",1,2,{"$f":"'F1'!D22","v":63},{"$f":"'F1'!E22","v":"PEDRINHO (SP)"},{"$f":"'F1'!L22","v":"DAVI ANDRADE (SP)"}]
[null,null,null,null,null,null,null,null,null,null,null,null,null,null,null,null,null,null,null,null,null,null,null,null,null,14,"1a Fase","SUB-18",1,2,{"$f":"'F1'!D23","v":64},{"$f":"'F1'!E23","v":"WALLACE RINCO (SP)"},{"$f":"'F1'!L23","v":"MELLI JR (SP)"}]
[null,null,null,null,null,null,null,null,null,null,null,null,null,null,null,null,null,null,null,null,null,null,null,null,null,15,"1a Fase","SUB-18",1,2,{"$f":"'F1'!D24","v":57},{"$f":"'F1'!E24","v":"RODRIGO (PE)"},{"$f":"'F1'!L24","v":"DANIEL COUTO (RJ)"}]
[null,null,null,null,null,null,null,null,null,null,null,null,null,null,null,null,null,null,null,null,null,null,null,null,null,16,"1a Fase","SUB-18",1,2,{"$f":"'F1'!D25","v":58},{"$f":"'F1'!E25","v":"LINNO BALA (PE)"},{"$f":"'F1'!L25","v":"VERISSON (PE)"}]
[null,null,{"$f":"$AA$1","v":"32º Campeonato Brasileiro Individual"},null,null,null,null,null,null,null,{"$f":"$AB$1","v":"Categoria"},null,null,null,{"$f":"$AA$1","v":"32º Campeonato Brasileiro Individual"},null,null,null,null,null,null,null,{"$f":"$AB$1","v":"Categoria"},null,null,17,"1a Fase","SUB-18",1,3,{"$f":"'F1'!D27","v":62},{"$f":"'F1'!E27","v":"LEO LIMA (SP)"},{"$f":"'F1'!L27","v":"PEDRO ANTONIO (SP)"}]
[null,null,{"$f":"$AA$4","v":"1a Fase"},null,null,null,null,null,null,null,{"$f":"$AB$4","v":"SUB-18"},null,null,null,{"$f":"$AA$5","v":"1a Fase"},null,null,null,null,null,null,null,{"$f":"$AB$5","v":"SUB-18"},null,null,18,"1a Fase","SUB-18",1,3,{"$f":"'F1'!D28","v":63},{"$f":"'F1'!E28","v":"TUGUINHA (SP)"},{"$f":"'F1'!L28","v":"CAROL (SP)"}]
[null,null,null,null,null,null,null,null,null,null,null,null,null,null,null,null,null,null,null,null,null,null,null,null,null,19,"1a Fase","SUB-18",1,3,{"$f":"'F1'!D29","v":64},{"$f":"'F1'!E29","v":"IGOR COSTA (SP)"},{"$f":"'F1'!L29","v":"VITOR HUGO (SP)"}]
[1,null,"Grupo",null,{"$f":"$AF$4","v":"IGOR COSTA (SP)"},null,null,null,null,null,null,null,null,null,"Grupo",null,{"$f":"$AF$5","v":"VITOR HUGO (SP)"},null,null,null,null,null,null,null,null,20,"1a Fase","SUB-18",1,3,{"$f":"'F1'!D30","v":57},{"$f":"'F1'!E30","v":"TUSURINHA (SP)"},{"$f":"'F1'!L30","v":"LUIZ GULHERME (SP)"}]
[1,null,{"$f":"$AC$4","v":1},null,null,null,null,null,null,null,null,null,null,null,{"$f":"$AC$5","v":1},null,null,null,null,null,null,null,null,null,null,21,"1a Fase","SUB-18",1,3,{"$f":"'F1'!D31","v":59},{"$f":"'F1'!E31","v":"PEDRINHO (SP)"},{"$f":"'F1'!L31","v":"WALLACE RINCO (SP)"}]
[null,null,null,null,null,null,null,null,null,null,null,null,null,null,null,null,null,null,null,null,null,null,null,null,null,22,"1a Fase","SUB-18",1,3,{"$f":"'F1'!D32","v":58},{"$f":"'F1'!E32","v":"DAVI ANDRADE (SP)"},{"$f":"'F1'!L32","v":"MELLI JR (SP)"}]
[null,null,null,null,null,null,null,null,null,null,null,null,null,null,null,null,null,null,null,null,null,null,null,null,null,23,"1a Fase","SUB-18",1,3,{"$f":"'F1'!D33","v":60},{"$f":"'F1'!E33","v":"RODRIGO (PE)"},{"$f":"'F1'!L33","v":"LINNO BALA (PE)"}]
[null,null,"Rodada",null,null,null,null,null,null,null,null,null,null,null,"Rodada",null,null,null,null,null,null,null,null,null,null,24,"1a Fase","SUB-18",1,3,{"$f":"'F1'!D34","v":61},{"$f":"'F1'!E34","v":"DANIEL COUTO (RJ)"},{"$f":"'F1'!L34","v":"VERISSON (PE)"}]
[null,null,{"$f":"$AD$4","v":1},null,null,null,null,null,null,null,null,null,null,null,{"$f":"$AD$5","v":1},null,null,null,null,null,null,null,null,null,null,25,"1a Fase","SUB-18",1,4,{"$f":"'F1'!D36","v":58},{"$f":"'F1'!E36","v":"LEO LIMA (SP)"},{"$f":"'F1'!L36","v":"IGOR COSTA (SP)"}]
[1,null,null,null,{"$f":"$AG$4","v":"LUIZ GULHERME (SP)"},null,null,null,null,null,null,null,null,null,null,null,{"$f":"$AG$5","v":"TUSURINHA (SP)"},null,null,null,null,null,null,null,null,26,"1a Fase","SUB-18",1,4,{"$f":"'F1'!D37","v":57},{"$f":"'F1'!E37","v":"PEDRO ANTONIO (SP)"},{"$f":"'F1'!L37","v":"VITOR HUGO (SP)"}]
[1,null,null,null,null,null,null,null,null,null,null,null,null,null,null,null,null,null,null,null,null,null,null,null,null,27,"1a Fase","SUB-18",1,4,{"$f":"'F1'!D38","v":59},{"$f":"'F1'!E38","v":"TUGUINHA (SP)"},{"$f":"'F1'!L38","v":"TUSURINHA (SP)"}]
[null,null,"Mesa",null,null,null,null,null,null,null,null,null,null,null,"Mesa",null,null,null,null,null,null,null,null,null,null,28,"1a Fase","SUB-18",1,4,{"$f":"'F1'!D39","v":60},{"$f":"'F1'!E39","v":"CAROL (SP)"},{"$f":"'F1'!L39","v":"LUIZ GULHERME (SP)"}]
[null,null,{"$f":"$AE$4","v":59},null,null,null,null,null,null,null,null,null,null,null,{"$f":"$AE$5","v":60},null,null,null,null,null,null,null,null,null,null,29,"1a Fase","SUB-18",1,4,{"$f":"'F1'!D40","v":62},{"$f":"'F1'!E40","v":"PEDRINHO (SP)"},{"$f":"'F1'!L40","v":"RODRIGO (PE)"}]
[null,null,null,null,null,null,null,null,null,null,null,null,null,null,null,null,null,null,null,null,null,null,null,null,null,30,"1a Fase","SUB-18",1,4,{"$f":"'F1'!D41","v":61},{"$f":"'F1'!E41","v":"WALLACE RINCO (SP)"},{"$f":"'F1'!L41","v":"LINNO BALA (PE)"}]
[null,null,null,null,null,null,null,null,null,null,null,null,null,null,null,null,null,null,null,null,null,null,null,null,null,31,"1a Fase","SUB-18",1,4,{"$f":"'F1'!D42","v":64},{"$f":"'F1'!E42","v":"DAVI ANDRADE (SP)"},{"$f":"'F1'!L42","v":"DANIEL COUTO (RJ)"}]
[null,null,null,null,null,null,null,null,null,null,null,null,null,null,null,null,null,null,null,null,null,null,null,null,null,32,"1a Fase","SUB-18",1,4,{"$f":"'F1'!D43","v":63},{"$f":"'F1'!E43","v":"MELLI JR (SP)"},{"$f":"'F1'!L43","v":"VERISSON (PE)"}]
[null,null,{"$f":"$AA$1","v":"32º Campeonato Brasileiro Individual"},null,null,null,null,null,null,null,{"$f":"$AB$1","v":"Categoria"},null,null,null,{"$f":"$AA$1","v":"32º Campeonato Brasileiro Individual"},null,null,null,null,null,null,null,{"$f":"$AB$1","v":"Categoria"},null,null,33,"1a Fase","SUB-18",1,5,{"$f":"'F1'!D45","v":60},{"$f":"'F1'!E45","v":"LEO LIMA (SP)"},{"$f":"'F1'!L45","v":"VITOR HUGO (SP)"}]
[null,null,{"$f":"$AA$6","v":"1a Fase"},null,null,null,null,null,null,null,{"$f":"$AB$6","v":"SUB-18"},null,null,null,{"$f":"$AA$7","v":"1a Fase"},null,null,null,null,null,null,null,{"$f":"$AB$7","v":"SUB-18"},null,null,34,{"$f":"AA34","v":"1a Fase"},{"$f":"AB34","v":"SUB-18"},1,5,{"$f":"'F1'!D46","v":61},{"$f":"'F1'!E46","v":"PEDRO ANTONIO (SP)"},{"$f":"'F1'!L46","v":"TUSURINHA (SP)"}]
[null,null,null,null,null,null,null,null,null,null,null,null,null,null,null,null,null,null,null,null,null,null,null,null,null,35,"1a Fase","SUB-18",1,5,{"$f":"'F1'!D47","v":62},{"$f":"'F1'!E47","v":"TUGUINHA (SP)"},{"$f":"'F1'!L47","v":"LUIZ GULHERME (SP)"}]
[1,null,"Grupo",null,{"$f":"$AF$6","v":"PEDRINHO (SP)"},null,null,null,null,null,null,null,null,null,"Grupo",null,{"$f":"$AF$7","v":"WALLACE RINCO (SP)"},null,null,null,null,null,null,null,null,36,"1a Fase","SUB-18",1,5,{"$f":"'F1'!D48","v":63},{"$f":"'F1'!E48","v":"CAROL (SP)"},{"$f":"'F1'!L48","v":"IGOR COSTA (SP)"}]
[1,null,{"$f":"$AC$6","v":1},null,null,null,null,null,null,null,null,null,null,null,{"$f":"$AC$7","v":1},null,null,null,null,null,null,null,null,null,null,37,"1a Fase","SUB-18",1,5,{"$f":"'F1'!D49","v":64},{"$f":"'F1'!E49","v":"PEDRINHO (SP)"},{"$f":"'F1'!L49","v":"LINNO BALA (PE)"}]
[null,null,null,null,null,null,null,null,null,null,null,null,null,null,null,null,null,null,null,null,null,null,null,null,null,38,"1a Fase","SUB-18",1,5,{"$f":"'F1'!D50","v":58},{"$f":"'F1'!E50","v":"WALLACE RINCO (SP)"},{"$f":"'F1'!L50","v":"DANIEL COUTO (RJ)"}]
[null,null,null,null,null,null,null,null,null,null,null,null,null,null,null,null,null,null,null,null,null,null,null,null,null,39,"1a Fase","SUB-18",1,5,{"$f":"'F1'!D51","v":57},{"$f":"'F1'!E51","v":"DAVI ANDRADE (SP)"},{"$f":"'F1'!L51","v":"VERISSON (PE)"}]
[null,null,"Rodada",null,null,null,null,null,null,null,null,null,null,null,"Rodada",null,null,null,null,null,null,null,null,null,null,40,"1a Fase","SUB-18",1,5,{"$f":"'F1'!D52","v":59},{"$f":"'F1'!E52","v":"MELLI JR (SP)"},{"$f":"'F1'!L52","v":"RODRIGO (PE)"}]
[null,null,{"$f":"$AD$6","v":1},null,null,null,null,null,null,null,null,null,null,null,{"$f":"$AD$7","v":1},null,null,null,null,null,null,null,null,null,null,41,"1a Fase","SUB-18",1,6,{"$f":"'F1'!D54","v":62},{"$f":"'F1'!E54","v":"LEO LIMA (SP)"},{"$f":"'F1'!L54","v":"TUSURINHA (SP)"}]
[1,null,null,null,{"$f":"$AG$6","v":"MELLI JR (SP)"},null,null,null,null,null,null,null,null,null,null,null,{"$f":"$AG$7","v":"DAVI ANDRADE (SP)"},null,null,null,null,null,null,null,null,42,"1a Fase","SUB-18",1,6,{"$f":"'F1'!D55","v":64},{"$f":"'F1'!E55","v":"PEDRO ANTONIO (SP)"},{"$f":"'F1'!L55","v":"LUIZ GULHERME (SP)"}]
[1,null,null,null,null,null,null,null,null,null,null,null,null,null,null,null,null,null,null,null,null,null,null,null,null,43,"1a Fase","SUB-18",1,6,{"$f":"'F1'!D56","v":57},{"$f":"'F1'!E56","v":"TUGUINHA (SP)"},{"$f":"'F1'!L56","v":"IGOR COSTA (SP)"}]
[null,null,"Mesa",null,null,null,null,null,null,null,null,null,null,null,"Mesa",null,null,null,null,null,null,null,null,null,null,44,"1a Fase","SUB-18",1,6,{"$f":"'F1'!D57","v":58},{"$f":"'F1'!E57","v":"CAROL (SP)"},{"$f":"'F1'!L57","v":"VITOR HUGO (SP)"}]
[null,null,{"$f":"$AE$6","v":61},null,null,null,null,null,null,null,null,null,null,null,{"$f":"$AE$7","v":62},null,null,null,null,null,null,null,null,null,null,45,"1a Fase","SUB-18",1,6,{"$f":"'F1'!D58","v":60},{"$f":"'F1'!E58","v":"PEDRINHO (SP)"},{"$f":"'F1'!L58","v":"DANIEL COUTO (RJ)"}]
[null,null,null,null,null,null,null,null,null,null,null,null,null,null,null,null,null,null,null,null,null,null,null,null,null,46,"1a Fase","SUB-18",1,6,{"$f":"'F1'!D59","v":59},{"$f":"'F1'!E59","v":"WALLACE RINCO (SP)"},{"$f":"'F1'!L59","v":"VERISSON (PE)"}]
[null,null,null,null,null,null,null,null,null,null,null,null,null,null,null,null,null,null,null,null,null,null,null,null,null,47,"1a Fase","SUB-18",1,6,{"$f":"'F1'!D60","v":61},{"$f":"'F1'!E60","v":"DAVI ANDRADE (SP)"},{"$f":"'F1'!L60","v":"RODRIGO (PE)"}]
[null,null,null,null,null,null,null,null,null,null,null,null,null,null,null,null,null,null,null,null,null,null,null,null,null,48,"1a Fase","SUB-18",1,6,{"$f":"'F1'!D61","v":63},{"$f":"'F1'!E61","v":"MELLI JR (SP)"},{"$f":"'F1'!L61","v":"LINNO BALA (PE)"}]
[null,null,{"$f":"$AA$1","v":"32º Campeonato Brasileiro Individual"},null,null,null,null,null,null,null,{"$f":"$AB$1","v":"Categoria"},null,null,null,{"$f":"$AA$1","v":"32º Campeonato Brasileiro Individual"},null,null,null,null,null,null,null,{"$f":"$AB$1","v":"Categoria"},null,null,49,"1a Fase","SUB-18",1,7,{"$f":"'F1'!D63","v":58},{"$f":"'F1'!E63","v":"LEO LIMA (SP)"},{"$f":"'F1'!L63","v":"LUIZ GULHERME (SP)"}]
[null,null,{"$f":"$AA$8","v":"1a Fase"},null,null,null,null,null,null,null,{"$f":"$AB$8","v":"SUB-18"},null,null,null,{"$f":"$AA$9","v":"1a Fase"},null,null,null,null,null,null,null,{"$f":"$AB$9","v":"SUB-18"},null,null,50,"1a Fase","SUB-18",1,7,{"$f":"'F1'!D64","v":59},{"$f":"'F1'!E64","v":"PEDRO ANTONIO (SP)"},{"$f":"'F1'!L64","v":"IGOR COSTA (SP)"}]
[null,null,null,null,null,null,null,null,null,null,null,null,null,null,null,null,null,null,null,null,null,null,null,null,null,51,"1a Fase","SUB-18",1,7,{"$f":"'F1'!D65","v":64},{"$f":"'F1'!E65","v":"TUGUINHA (SP)"},{"$f":"'F1'!L65","v":"VITOR HUGO (SP)"}]
[1,null,"Grupo",null,{"$f":"$AF$8","v":"RODRIGO (PE)"},null,null,null,null,null,null,null,null,null,"Grupo",null,{"$f":"$AF$9","v":"LINNO BALA (PE)"},null,null,null,null,null,null,null,null,52,"1a Fase","SUB-18",1,7,{"$f":"'F1'!D66","v":61},{"$f":"'F1'!E66","v":"CAROL (SP)"},{"$f":"'F1'!L66","v":"TUSURINHA (SP)"}]
[1,null,{"$f":"$AC$8","v":1},null,null,null,null,null,null,null,null,null,null,null,{"$f":"$AC$9","v":1},null,null,null,null,null,null,null,null,null,null,53,"1a Fase","SUB-18",1,7,{"$f":"'F1'!D67","v":57},{"$f":"'F1'!E67","v":"PEDRINHO (SP)"},{"$f":"'F1'!L67","v":"VERISSON (PE)"}]
[null,null,null,null,null,null,null,null,null,null,null,null,null,null,null,null,null,null,null,null,null,null,null,null,null,54,"1a Fase","SUB-18",1,7,{"$f":"'F1'!D68","v":63},{"$f":"'F1'!E68","v":"WALLACE RINCO (SP)"},{"$f":"'F1'!L68","v":"RODRIGO (PE)"}]
[null,null,null,null,null,null,null,null,null,null,null,null,null,null,null,null,null,null,null,null,null,null,null,null,null,55,"1a Fase","SUB-18",1,7,{"$f":"'F1'!D69","v":60},{"$f":"'F1'!E69","v":"DAVI ANDRADE (SP)"},{"$f":"'F1'!L69","v":"LINNO BALA (PE)"}]
[null,null,"Rodada",null,null,null,null,null,null,null,null,null,null,null,"Rodada",null,null,null,null,null,null,null,null,null,null,56,"1a Fase","SUB-18",1,7,{"$f":"'F1'!D70","v":62},{"$f":"'F1'!E70","v":"MELLI JR (SP)"},{"$f":"'F1'!L70","v":"DANIEL COUTO (RJ)"}]
[null,null,{"$f":"$AD$8","v":1},null,null,null,null,null,null,null,null,null,null,null,{"$f":"$AD$9","v":1},null,null,null,null,null,null,null,null,null,null,57,"1a Fase","SUB-18",1,8,{"$f":"'F1'!D72","v":61},{"$f":"'F1'!E72","v":"LEO LIMA (SP)"},{"$f":"'F1'!L72","v":"PEDRINHO (SP)"}]
[1,null,null,null,{"$f":"$AG$8","v":"VERISSON (PE)"},null,null,null,null,null,null,null,null,null,null,null,{"$f":"$AG$9","v":"DANIEL COUTO (RJ)"},null,null,null,null,null,null,null,null,58,"1a Fase","SUB-18",1,8,{"$f":"'F1'!D73","v":62},{"$f":"'F1'!E73","v":"PEDRO ANTONIO (SP)"},{"$f":"'F1'!L73","v":"WALLACE RINCO (SP)"}]
[1,null,null,null,null,null,null,null,null,null,null,null,null,null,null,null,null,null,null,null,null,null,null,null,null,59,"1a Fase","SUB-18",1,8,{"$f":"'F1'!D74","v":63},{"$f":"'F1'!E74","v":"TUGUINHA (SP)"},{"$f":"'F1'!L74","v":"DAVI ANDRADE (SP)"}]
[null,null,"Mesa",null,null,null,null,null,null,null,null,null,null,null,"Mesa",null,null,null,null,null,null,null,null,null,null,60,"1a Fase","SUB-18",1,8,{"$f":"'F1'!D75","v":64},{"$f":"'F1'!E75","v":"CAROL (SP)"},{"$f":"'F1'!L75","v":"MELLI JR (SP)"}]
[null,null,{"$f":"$AE$8","v":63},null,null,null,null,null,null,null,null,null,null,null,{"$f":"$AE$9","v":64},null,null,null,null,null,null,null,null,null,null,61,"1a Fase","SUB-18",1,8,{"$f":"'F1'!D76","v":57},{"$f":"'F1'!E76","v":"IGOR COSTA (SP)"},{"$f":"'F1'!L76","v":"RODRIGO (PE)"}]
[null,null,null,null,null,null,null,null,null,null,null,null,null,null,null,null,null,null,null,null,null,null,null,null,null,62,"1a Fase","SUB-18",1,8,{"$f":"'F1'!D77","v":58},{"$f":"'F1'!E77","v":"VITOR HUGO (SP)"},{"$f":"'F1'!L77","v":"LINNO BALA (PE)"}]
[null,null,null,null,null,null,null,null,null,null,null,null,null,null,null,null,null,null,null,null,null,null,null,null,null,63,"1a Fase","SUB-18",1,8,{"$f":"'F1'!D78","v":59},{"$f":"'F1'!E78","v":"TUSURINHA (SP)"},{"$f":"'F1'!L78","v":"DANIEL COUTO (RJ)"}]
[null,null,null,null,null,null,null,null,null,null,null,null,null,null,null,null,null,null,null,null,null,null,null,null,null,64,"1a Fase","SUB-18",1,8,{"$f":"'F1'!D79","v":60},{"$f":"'F1'!E79","v":"LUIZ GULHERME (SP)"},{"$f":"'F1'!L79","v":"VERISSON (PE)"}]
[null,null,{"$f":"$AA$1","v":"32º Campeonato Brasileiro Individual"},null,null,null,null,null,null,null,{"$f":"$AB$1","v":"Categoria"},null,null,null,{"$f":"$AA$1","v":"32º Campeonato Brasileiro Individual"},null,null,null,null,null,null,null,{"$f":"$AB$1","v":"Categoria"},null,null,65,"1a Fase","SUB-18",1,9,{"$f":"'F1'!D81","v":57},{"$f":"'F1'!E81","v":"LEO LIMA (SP)"},{"$f":"'F1'!L81","v":"WALLACE RINCO (SP)"}]
[null,null,{"$f":"$AA$10","v":"1a Fase"},null,null,null,null,null,null,null,{"$f":"$AB$10","v":"SUB-18"},null,null,null,{"$f":"$AA$11","v":"1a Fase"},null,null,null,null,null,null,null,{"$f":"$AB$11","v":"SUB-18"},null,null,66,{"$f":"AA66","v":"1a Fase"},{"$f":"AB66","v":"SUB-18"},1,9,{"$f":"'F1'!D82","v":58},{"$f":"'F1'!E82","v":"PEDRO ANTONIO (SP)"},{"$f":"'F1'!L82","v":"DAVI ANDRADE (SP)"}]
[null,null,null,null,null,null,null,null,null,null,null,null,null,null,null,null,null,null,null,null,null,null,null,null,null,67,"1a Fase","SUB-18",1,9,{"$f":"'F1'!D83","v":59},{"$f":"'F1'!E83","v":"TUGUINHA (SP)"},{"$f":"'F1'!L83","v":"MELLI JR (SP)"}]
[1,null,"Grupo",null,{"$f":"$AF$10","v":"LEO LIMA (SP)"},null,null,null,null,null,null,null,null,null,"Grupo",null,{"$f":"$AF$11","v":"PEDRO ANTONIO (SP)"},null,null,null,null,null,null,null,null,68,"1a Fase","SUB-18",1,9,{"$f":"'F1'!D84","v":60},{"$f":"'F1'!E84","v":"CAROL (SP)"},{"$f":"'F1'!L84","v":"RODRIGO (PE)"}]
[1,null,{"$f":"$AC$10","v":1},null,null,null,null,null,null,null,null,null,null,null,{"$f":"$AC$11","v":1},null,null,null,null,null,null,null,null,null,null,69,"1a Fase","SUB-18",1,9,{"$f":"'F1'!D85","v":61},{"$f":"'F1'!E85","v":"IGOR COSTA (SP)"},{"$f":"'F1'!L85","v":"LINNO BALA (PE)"}]
[null,null,null,null,null,null,null,null,null,null,null,null,null,null,null,null,null,null,null,null,null,null,null,null,null,70,"1a Fase","SUB-18",1,9,{"$f":"'F1'!D86","v":62},{"$f":"'F1'!E86","v":"VITOR HUGO (SP)"},{"$f":"'F1'!L86","v":"DANIEL COUTO (RJ)"}]
[null,null,null,null,null,null,null,null,null,null,null,null,null,null,null,null,null,null,null,null,null,null,null,null,null,71,"1a Fase","SUB-18",1,9,{"$f":"'F1'!D87","v":63},{"$f":"'F1'!E87","v":"TUSURINHA (SP)"},{"$f":"'F1'!L87","v":"VERISSON (PE)"}]
[null,null,"Rodada",null,null,null,null,null,null,null,null,null,null,null,"Rodada",null,null,null,null,null,null,null,null,null,null,72,"1a Fase","SUB-18",1,9,{"$f":"'F1'!D88","v":64},{"$f":"'F1'!E88","v":"LUIZ GULHERME (SP)"},{"$f":"'F1'!L88","v":"PEDRINHO (SP)"}]
[null,null,{"$f":"$AD$10","v":2},null,null,null,null,null,null,null,null,null,null,null,{"$f":"$AD$11","v":2},null,null,null,null,null,null,null,null,null,null,73,"1a Fase","SUB-18",1,10,{"$f":"'F1'!D90","v":59},{"$f":"'F1'!E90","v":"LEO LIMA (SP)"},{"$f":"'F1'!L90","v":"DAVI ANDRADE (SP)"}]
[1,null,null,null,{"$f":"$AG$10","v":"TUGUINHA (SP)"},null,null,null,null,null,null,null,null,null,null,null,{"$f":"$AG$11","v":"CAROL (SP)"},null,null,null,null,null,null,null,null,74,"1a Fase","SUB-18",1,10,{"$f":"'F1'!D91","v":60},{"$f":"'F1'!E91","v":"PEDRO ANTONIO (SP)"},{"$f":"'F1'!L91","v":"MELLI JR (SP)"}]
[1,null,null,null,null,null,null,null,null,null,null,null,null,null,null,null,null,null,null,null,null,null,null,null,null,75,"1a Fase","SUB-18",1,10,{"$f":"'F1'!D92","v":58},{"$f":"'F1'!E92","v":"TUGUINHA (SP)"},{"$f":"'F1'!L92","v":"RODRIGO (PE)"}]
[null,null,"Mesa",null,null,null,null,null,null,null,null,null,null,null,"Mesa",null,null,null,null,null,null,null,null,null,null,76,"1a Fase","SUB-18",1,10,{"$f":"'F1'!D93","v":62},{"$f":"'F1'!E93","v":"CAROL (SP)"},{"$f":"'F1'!L93","v":"LINNO BALA (PE)"}]
[null,null,{"$f":"$AE$10","v":60},null,null,null,null,null,null,null,null,null,null,null,{"$f":"$AE$11","v":59},null,null,null,null,null,null,null,null,null,null,77,"1a Fase","SUB-18",1,10,{"$f":"'F1'!D94","v":63},{"$f":"'F1'!E94","v":"IGOR COSTA (SP)"},{"$f":"'F1'!L94","v":"DANIEL COUTO (RJ)"}]
[null,null,null,null,null,null,null,null,null,null,null,null,null,null,null,null,null,null,null,null,null,null,null,null,null,78,"1a Fase","SUB-18",1,10,{"$f":"'F1'!D95","v":64},{"$f":"'F1'!E95","v":"VITOR HUGO (SP)"},{"$f":"'F1'!L95","v":"VERISSON (PE)"}]
[null,null,null,null,null,null,null,null,null,null,null,null,null,null,null,null,null,null,null,null,null,null,null,null,null,79,"1a Fase","SUB-18",1,10,{"$f":"'F1'!D96","v":57},{"$f":"'F1'!E96","v":"TUSURINHA (SP)"},{"$f":"'F1'!L96","v":"PEDRINHO (SP)"}]
[null,null,null,null,null,null,null,null,null,null,null,null,null,null,null,null,null,null,null,null,null,null,null,null,null,80,"1a Fase","SUB-18",1,10,{"$f":"'F1'!D97","v":61},{"$f":"'F1'!E97","v":"LUIZ GULHERME (SP)"},{"$f":"'F1'!L97","v":"WALLACE RINCO (SP)"}]
[null,null,{"$f":"$AA$1","v":"32º Campeonato Brasileiro Individual"},null,null,null,null,null,null,null,{"$f":"$AB$1","v":"Categoria"},null,null,null,{"$f":"$AA$1","v":"32º Campeonato Brasileiro Individual"},null,null,null,null,null,null,null,{"$f":"$AB$1","v":"Categoria"},null,null,81,"1a Fase","SUB-18",1,11,{"$f":"'F1'!D99","v":62},{"$f":"'F1'!E99","v":"LEO LIMA (SP)"},{"$f":"'F1'!L99","v":"MELLI JR (SP)"}]
[null,null,{"$f":"$AA$12","v":"1a Fase"},null,null,null,null,null,null,null,{"$f":"$AB$12","v":"SUB-18"},null,null,null,{"$f":"$AA$13","v":"1a Fase"},null,null,null,null,null,null,null,{"$f":"$AB$13","v":"SUB-18"},null,null,82,"1a Fase","SUB-18",1,11,{"$f":"'F1'!D100","v":63},{"$f":"'F1'!E100","v":"PEDRO ANTONIO (SP)"},{"$f":"'F1'!L100","v":"RODRIGO (PE)"}]
[null,null,null,null,null,null,null,null,null,null,null,null,null,null,null,null,null,null,null,null,null,null,null,null,null,83,"1a Fase","SUB-18",1,11,{"$f":"'F1'!D101","v":61},{"$f":"'F1'!E101","v":"TUGUINHA (SP)"},{"$f":"'F1'!L101","v":"LINNO BALA (PE)"}]
[1,null,"Grupo",null,{"$f":"$AF$12","v":"IGOR COSTA (SP)"},null,null,null,null,null,null,null,null,null,"Grupo",null,{"$f":"$AF$13","v":"VITOR HUGO (SP)"},null,null,null,null,null,null,null,null,84,"1a Fase","SUB-18",1,11,{"$f":"'F1'!D102","v":57},{"$f":"'F1'!E102","v":"CAROL (SP)"},{"$f":"'F1'!L102","v":"DANIEL COUTO (RJ)"}]
[1,null,{"$f":"$AC$12","v":1},null,null,null,null,null,null,null,null,null,null,null,{"$f":"$AC$13","v":1},null,null,null,null,null,null,null,null,null,null,85,"1a Fase","SUB-18",1,11,{"$f":"'F1'!D103","v":58},{"$f":"'F1'!E103","v":"IGOR COSTA (SP)"},{"$f":"'F1'!L103","v":"VERISSON (PE)"}]
[null,null,null,null,null,null,null,null,null,null,null,null,null,null,null,null,null,null,null,null,null,null,null,null,null,86,"1a Fase","SUB-18",1,11,{"$f":"'F1'!D104","v":59},{"$f":"'F1'!E104","v":"VITOR HUGO (SP)"},{"$f":"'F1'!L104","v":"PEDRINHO (SP)"}]
[null,null,null,null,null,null,null,null,null,null,null,null,null,null,null,null,null,null,null,null,null,null,null,null,null,87,"1a Fase","SUB-18",1,11,{"$f":"'F1'!D105","v":60},{"$f":"'F1'!E105","v":"TUSURINHA (SP)"},{"$f":"'F1'!L105","v":"WALLACE RINCO (SP)"}]
[null,null,"Rodada",null,null,null,null,null,null,null,null,null,null,null,"Rodada",null,null,null,null,null,null,null,null,null,null,88,"1a Fase","SUB-18",1,11,{"$f":"'F1'!D106","v":64},{"$f":"'F1'!E106","v":"LUIZ GULHERME (SP)"},{"$f":"'F1'!L106","v":"DAVI ANDRADE (SP)"}]
[null,null,{"$f":"$AD$12","v":2},null,null,null,null,null,null,null,null,null,null,null,{"$f":"$AD$13","v":2},null,null,null,null,null,null,null,null,null,null,89,"1a Fase","SUB-18",1,12,{"$f":"'F1'!D108","v":64},{"$f":"'F1'!E108","v":"LEO LIMA (SP)"},{"$f":"'F1'!L108","v":"RODRIGO (PE)"}]
[1,null,null,null,{"$f":"$AG$12","v":"TUSURINHA (SP)"},null,null,null,null,null,null,null,null,null,null,null,{"$f":"$AG$13","v":"LUIZ GULHERME (SP)"},null,null,null,null,null,null,null,null,90,"1a Fase","SUB-18",1,12,{"$f":"'F1'!D109","v":58},{"$f":"'F1'!E109","v":"PEDRO ANTONIO (SP)"},{"$f":"'F1'!L109","v":"LINNO BALA (PE)"}]
[1,null,null,null,null,null,null,null,null,null,null,null,null,null,null,null,null,null,null,null,null,null,null,null,null,91,"1a Fase","SUB-18",1,12,{"$f":"'F1'!D110","v":59},{"$f":"'F1'!E110","v":"TUGUINHA (SP)"},{"$f":"'F1'!L110","v":"DANIEL COUTO (RJ)"}]
[null,null,"Mesa",null,null,null,null,null,null,null,null,null,null,null,"Mesa",null,null,null,null,null,null,null,null,null,null,92,"1a Fase","SUB-18",1,12,{"$f":"'F1'!D111","v":60},{"$f":"'F1'!E111","v":"CAROL (SP)"},{"$f":"'F1'!L111","v":"VERISSON (PE)"}]
[null,null,{"$f":"$AE$12","v":62},null,null,null,null,null,null,null,null,null,null,null,{"$f":"$AE$13","v":61},null,null,null,null,null,null,null,null,null,null,93,"1a Fase","SUB-18",1,12,{"$f":"'F1'!D112","v":62},{"$f":"'F1'!E112","v":"IGOR COSTA (SP)"},{"$f":"'F1'!L112","v":"PEDRINHO (SP)"}]
[null,null,null,null,null,null,null,null,null,null,null,null,null,null,null,null,null,null,null,null,null,null,null,null,null,94,"1a Fase","SUB-18",1,12,{"$f":"'F1'!D113","v":61},{"$f":"'F1'!E113","v":"VITOR HUGO (SP)"},{"$f":"'F1'!L113","v":"WALLACE RINCO (SP)"}]
[null,null,null,null,null,null,null,null,null,null,null,null,null,null,null,null,null,null,null,null,null,null,null,null,null,95,"1a Fase","SUB-18",1,12,{"$f":"'F1'!D114","v":63},{"$f":"'F1'!E114","v":"TUSURINHA (SP)"},{"$f":"'F1'!L114","v":"DAVI ANDRADE (SP)"}]
[null,null,null,null,null,null,null,null,null,null,null,null,null,null,null,null,null,null,null,null,null,null,null,null,null,96,"1a Fase","SUB-18",1,12,{"$f":"'F1'!D115","v":57},{"$f":"'F1'!E115","v":"LUIZ GULHERME (SP)"},{"$f":"'F1'!L115","v":"MELLI JR (SP)"}]
[null,null,{"$f":"$AA$1","v":"32º Campeonato Brasileiro Individual"},null,null,null,null,null,null,null,{"$f":"$AB$1","v":"Categoria"},null,null,null,{"$f":"$AA$1","v":"32º Campeonato Brasileiro Individual"},null,null,null,null,null,null,null,{"$f":"$AB$1","v":"Categoria"},null,null,97,"1a Fase","SUB-18",1,13,{"$f":"'F1'!D117","v":60},{"$f":"'F1'!E117","v":"LEO LIMA (SP)"},{"$f":"'F1'!L117","v":"LINNO BALA (PE)"}]
[null,null,{"$f":"$AA$14","v":"1a Fase"},null,null,null,null,null,null,null,{"$f":"$AB$14","v":"SUB-18"},null,null,null,{"$f":"$AA$15","v":"1a Fase"},null,null,null,null,null,null,null,{"$f":"$AB$15","v":"SUB-18"},null,null,98,{"$f":"AA98","v":"1a Fase"},{"$f":"AB98","v":"SUB-18"},1,13,{"$f":"'F1'!D118","v":61},{"$f":"'F1'!E118","v":"PEDRO ANTONIO (SP)"},{"$f":"'F1'!L118","v":"DANIEL COUTO (RJ)"}]
[null,null,null,null,null,null,null,null,null,null,null,null,null,null,null,null,null,null,null,null,null,null,null,null,null,99,"1a Fase","SUB-18",1,13,{"$f":"'F1'!D119","v":62},{"$f":"'F1'!E119","v":"TUGUINHA (SP)"},{"$f":"'F1'!L119","v":"VERISSON (PE)"}]
[1,null,"Grupo",null,{"$f":"$AF$14","v":"PEDRINHO (SP)"},null,null,null,null,null,null,null,null,null,"Grupo",null,{"$f":"$AF$15","v":"WALLACE RINCO (SP)"},null,null,null,null,null,null,null,null,100,"1a Fase","SUB-18",1,13,{"$f":"'F1'!D120","v":63},{"$f":"'F1'!E120","v":"CAROL (SP)"},{"$f":"'F1'!L120","v":"PEDRINHO (SP)"}]
[1,null,{"$f":"$AC$14","v":1},null,null,null,null,null,null,null,null,null,null,null,{"$f":"$AC$15","v":1},null,null,null,null,null,null,null,null,null,null,101,"1a Fase","SUB-18",1,13,{"$f":"'F1'!D121","v":64},{"$f":"'F1'!E121","v":"IGOR COSTA (SP)"},{"$f":"'F1'!L121","v":"WALLACE RINCO (SP)"}]
[null,null,null,null,null,null,null,null,null,null,null,null,null,null,null,null,null,null,null,null,null,null,null,null,null,102,"1a Fase","SUB-18",1,13,{"$f":"'F1'!D122","v":57},{"$f":"'F1'!E122","v":"VITOR HUGO (SP)"},{"$f":"'F1'!L122","v":"DAVI ANDRADE (SP)"}]
[null,null,null,null,null,null,null,null,null,null,null,null,null,null,null,null,null,null,null,null,null,null,null,null,null,103,"1a Fase","SUB-18",1,13,{"$f":"'F1'!D123","v":58},{"$f":"'F1'!E123","v":"TUSURINHA (SP)"},{"$f":"'F1'!L123","v":"MELLI JR (SP)"}]
[null,null,"Rodada",null,null,null,null,null,null,null,null,null,null,null,"Rodada",null,null,null,null,null,null,null,null,null,null,104,"1a Fase","SUB-18",1,13,{"$f":"'F1'!D124","v":59},{"$f":"'F1'!E124","v":"LUIZ GULHERME (SP)"},{"$f":"'F1'!L124","v":"RODRIGO (PE)"}]
[null,null,{"$f":"$AD$14","v":2},null,null,null,null,null,null,null,null,null,null,null,{"$f":"$AD$15","v":2},null,null,null,null,null,null,null,null,null,null,105,"1a Fase","SUB-18",1,14,{"$f":"'F1'!D126","v":63},{"$f":"'F1'!E126","v":"LEO LIMA (SP)"},{"$f":"'F1'!L126","v":"DANIEL COUTO (RJ)"}]
[1,null,null,null,{"$f":"$AG$14","v":"DAVI ANDRADE (SP)"},null,null,null,null,null,null,null,null,null,null,null,{"$f":"$AG$15","v":"MELLI JR (SP)"},null,null,null,null,null,null,null,null,106,"1a Fase","SUB-18",1,14,{"$f":"'F1'!D127","v":64},{"$f":"'F1'!E127","v":"PEDRO ANTONIO (SP)"},{"$f":"'F1'!L127","v":"VERISSON (PE)"}]
[1,null,null,null,null,null,null,null,null,null,null,null,null,null,null,null,null,null,null,null,null,null,null,null,null,107,"1a Fase","SUB-18",1,14,{"$f":"'F1'!D128","v":58},{"$f":"'F1'!E128","v":"TUGUINHA (SP)"},{"$f":"'F1'!L128","v":"PEDRINHO (SP)"}]
[null,null,"Mesa",null,null,null,null,null,null,null,null,null,null,null,"Mesa",null,null,null,null,null,null,null,null,null,null,108,"1a Fase","SUB-18",1,14,{"$f":"'F1'!D129","v":57},{"$f":"'F1'!E129","v":"CAROL (SP)"},{"$f":"'F1'!L129","v":"WALLACE RINCO (SP)"}]
[null,null,{"$f":"$AE$14","v":63},null,null,null,null,null,null,null,null,null,null,null,{"$f":"$AE$15","v":64},null,null,null,null,null,null,null,null,null,null,109,"1a Fase","SUB-18",1,14,{"$f":"'F1'!D130","v":59},{"$f":"'F1'!E130","v":"IGOR COSTA (SP)"},{"$f":"'F1'!L130","v":"DAVI ANDRADE (SP)"}]
[null,null,null,null,null,null,null,null,null,null,null,null,null,null,null,null,null,null,null,null,null,null,null,null,null,110,"1a Fase","SUB-18",1,14,{"$f":"'F1'!D131","v":60},{"$f":"'F1'!E131","v":"VITOR HUGO (SP)"},{"$f":"'F1'!L131","v":"MELLI JR (SP)"}]
[null,null,null,null,null,null,null,null,null,null,null,null,null,null,null,null,null,null,null,null,null,null,null,null,null,111,"1a Fase","SUB-18",1,14,{"$f":"'F1'!D132","v":61},{"$f":"'F1'!E132","v":"TUSURINHA (SP)"},{"$f":"'F1'!L132","v":"RODRIGO (PE)"}]
[null,null,null,null,null,null,null,null,null,null,null,null,null,null,null,null,null,null,null,null,null,null,null,null,null,112,"1a Fase","SUB-18",1,14,{"$f":"'F1'!D133","v":62},{"$f":"'F1'!E133","v":"LUIZ GULHERME (SP)"},{"$f":"'F1'!L133","v":"LINNO BALA (PE)"}]
[null,null,{"$f":"$AA$1","v":"32º Campeonato Brasileiro Individual"},null,null,null,null,null,null,null,{"$f":"$AB$1","v":"Categoria"},null,null,null,{"$f":"$AA$1","v":"32º Campeonato Brasileiro Individual"},null,null,null,null,null,null,null,{"$f":"$AB$1","v":"Categoria"},null,null,113,"1a Fase","SUB-18",1,15,{"$f":"'F1'!D135","v":58},{"$f":"'F1'!E135","v":"LEO LIMA (SP)"},{"$f":"'F1'!L135","v":"VERISSON (PE)"}]
[null,null,{"$f":"$AA$16","v":"1a Fase"},null,null,null,null,null,null,null,{"$f":"$AB$16","v":"SUB-18"},null,null,null,{"$f":"$AA$17","v":"1a Fase"},null,null,null,null,null,null,null,{"$f":"$AB$17","v":"SUB-18"},null,null,114,"1a Fase","SUB-18",1,15,{"$f":"'F1'!D136","v":59},{"$f":"'F1'!E136","v":"PEDRO ANTONIO (SP)"},{"$f":"'F1'!L136","v":"PEDRINHO (SP)"}]
[null,null,null,null,null,null,null,null,null,null,null,null,null,null,null,null,null,null,null,null,null,null,null,null,null,115,"1a Fase","SUB-18",1,15,{"$f":"'F1'!D137","v":60},{"$f":"'F1'!E137","v":"TUGUINHA (SP)"},{"$f":"'F1'!L137","v":"WALLACE RINCO (SP)"}]
[1,null,"Grupo",null,{"$f":"$AF$16","v":"RODRIGO (PE)"},null,null,null,null,null,null,null,null,null,"Grupo",null,{"$f":"$AF$17","v":"LINNO BALA (PE)"},null,null,null,null,null,null,null,null,116,"1a Fase","SUB-18",1,15,{"$f":"'F1'!D138","v":61},{"$f":"'F1'!E138","v":"CAROL (SP)"},{"$f":"'F1'!L138","v":"DAVI ANDRADE (SP)"}]
[1,null,{"$f":"$AC$16","v":1},null,null,null,null,null,null,null,null,null,null,null,{"$f":"$AC$17","v":1},null,null,null,null,null,null,null,null,null,null,117,"1a Fase","SUB-18",1,15,{"$f":"'F1'!D139","v":63},{"$f":"'F1'!E139","v":"IGOR COSTA (SP)"},{"$f":"'F1'!L139","v":"MELLI JR (SP)"}]
[null,null,null,null,null,null,null,null,null,null,null,null,null,null,null,null,null,null,null,null,null,null,null,null,null,118,"1a Fase","SUB-18",1,15,{"$f":"'F1'!D140","v":62},{"$f":"'F1'!E140","v":"VITOR HUGO (SP)"},{"$f":"'F1'!L140","v":"RODRIGO (PE)"}]
[null,null,null,null,null,null,null,null,null,null,null,null,null,null,null,null,null,null,null,null,null,null,null,null,null,119,"1a Fase","SUB-18",1,15,{"$f":"'F1'!D141","v":64},{"$f":"'F1'!E141","v":"TUSURINHA (SP)"},{"$f":"'F1'!L141","v":"LINNO BALA (PE)"}]
[null,null,"Rodada",null,null,null,null,null,null,null,null,null,null,null,"Rodada",null,null,null,null,null,null,null,null,null,null,120,"1a Fase","SUB-18",1,15,{"$f":"'F1'!D142","v":57},{"$f":"'F1'!E142","v":"LUIZ GULHERME (SP)"},{"$f":"'F1'!L142","v":"DANIEL COUTO (RJ)"}]
[null,null,{"$f":"$AD$16","v":2},null,null,null,null,null,null,null,null,null,null,null,{"$f":"$AD$17","v":2}]
[1,null,null,null,{"$f":"$AG$16","v":"DANIEL COUTO (RJ)"},null,null,null,null,null,null,null,null,null,null,null,{"$f":"$AG$17","v":"VERISSON (PE)"}]
[1]
[null,null,"Mesa",null,null,null,null,null,null,null,null,null,null,null,"Mesa"]
[null,null,{"$f":"$AE$16","v":57},null,null,null,null,null,null,null,null,null,null,null,{"$f":"$AE$17","v":58}]
[]
[]
[]
[null,null,{"$f":"$AA$1","v":"32º Campeonato Brasileiro Individual"},null,null,null,null,null,null,null,{"$f":"$AB$1","v":"Categoria"},null,null,null,{"$f":"$AA$1","v":"32º Campeonato Brasileiro Individual"},null,null,null,null,null,null,null,{"$f":"$AB$1","v":"Categoria"}]
[null,null,{"$f":"$AA$18","v":"1a Fase"},null,null,null,null,null,null,null,{"$f":"$AB$18","v":"SUB-18"},null,null,null,{"$f":"$AA$19","v":"1a Fase"},null,null,null,null,null,null,null,{"$f":"$AB$19","v":"SUB-18"}]
[]
[1,null,"Grupo",null,{"$f":"$AF$18","v":"LEO LIMA (SP)"},null,null,null,null,null,null,null,null,null,"Grupo",null,{"$f":"$AF$19","v":"TUGUINHA (SP)"}]
[1,null,{"$f":"$AC$18","v":1},null,null,null,null,null,null,null,null,null,null,null,{"$f":"$AC$19","v":1}]
[]
[]
[null,null,"Rodada",null,null,null,null,null,null,null,null,null,null,null,"Rodada"]
[null,null,{"$f":"$AD$18","v":3},null,null,null,null,null,null,null,null,null,null,null,{"$f":"$AD$19","v":3}]
[1,null,null,null,{"$f":"$AG$18","v":"PEDRO ANTONIO (SP)"},null,null,null,null,null,null,null,null,null,null,null,{"$f":"$AG$19","v":"CAROL (SP)"}]
[1]
[null,null,"Mesa",null,null,null,null,null,null,null,null,null,null,null,"Mesa"]
[null,null,{"$f":"$AE$18","v":62},null,null,null,null,null,null,null,null,null,null,null,{"$f":"$AE$19","v":63}]
[]
[]
[]
[null,null,{"$f":"$AA$1","v":"32º Campeonato Brasileiro Individual"},null,null,null,null,null,null,null,{"$f":"$AB$1","v":"Categoria"},null,null,null,{"$f":"$AA$1","v":"32º Campeonato Brasileiro Individual"},null,null,null,null,null,null,null,{"$f":"$AB$1","v":"Categoria"}]
[null,null,{"$f":"$AA$20","v":"1a Fase"},null,null,null,null,null,null,null,{"$f":"$AB$20","v":"SUB-18"},null,null,null,{"$f":"$AA$21","v":"1a Fase"},null,null,null,null,null,null,null,{"$f":"$AB$21","v":"SUB-18"}]
[]
[1,null,"Grupo",null,{"$f":"$AF$20","v":"IGOR COSTA (SP)"},null,null,null,null,null,null,null,null,null,"Grupo",null,{"$f":"$AF$21","v":"TUSURINHA (SP)"}]
[1,null,{"$f":"$AC$20","v":1},null,null,null,null,null,null,null,null,null,null,null,{"$f":"$AC$21","v":1}]
[]
[]
[null,null,"Rodada",null,null,null,null,null,null,null,null,null,null,null,"Rodada"]
[null,null,{"$f":"$AD$20","v":3},null,null,null,null,null,null,null,null,null,null,null,{"$f":"$AD$21","v":3}]
[1,null,null,null,{"$f":"$AG$20","v":"VITOR HUGO (SP)"},null,null,null,null,null,null,null,null,null,null,null,{"$f":"$AG$21","v":"LUIZ GULHERME (SP)"}]
[1]
[null,null,"Mesa",null,null,null,null,null,null,null,null,null,null,null,"Mesa"]
[null,null,{"$f":"$AE$20","v":64},null,null,null,null,null,null,null,null,null,null,null,{"$f":"$AE$21","v":57}]
[]
[]
[]
[null,null,{"$f":"$AA$1","v":"32º Campeonato Brasileiro Individual"},null,null,null,null,null,null,null,{"$f":"$AB$1","v":"Categoria"},null,null,null,{"$f":"$AA$1","v":"32º Campeonato Brasileiro Individual"},null,null,null,null,null,null,null,{"$f":"$AB$1","v":"Categoria"}]
[null,null,{"$f":"$AA$22","v":"1a Fase"},null,null,null,null,null,null,null,{"$f":"$AB$22","v":"SUB-18"},null,null,null,{"$f":"$AA$23","v":"1a Fase"},null,null,null,null,null,null,null,{"$f":"$AB$23","v":"SUB-18"}]
[]
[1,null,"Grupo",null,{"$f":"$AF$22","v":"PEDRINHO (SP)"},null,null,null,null,null,null,null,null,null,"Grupo",null,{"$f":"$AF$23","v":"DAVI ANDRADE (SP)"}]
[1,null,{"$f":"$AC$22","v":1},null,null,null,null,null,null,null,null,null,null,null,{"$f":"$AC$23","v":1}]
[]
[]
[null,null,"Rodada",null,null,null,null,null,null,null,null,null,null,null,"Rodada"]
[null,null,{"$f":"$AD$22","v":3},null,null,null,null,null,null,null,null,null,null,null,{"$f":"$AD$23","v":3}]
[1,null,null,null,{"$f":"$AG$22","v":"WALLACE RINCO (SP)"},null,null,null,null,null,null,null,null,null,null,null,{"$f":"$AG$23","v":"MELLI JR (SP)"}]
[1]
[null,null,"Mesa",null,null,null,null,null,null,null,null,null,null,null,"Mesa"]
[null,null,{"$f":"$AE$22","v":59},null,null,null,null,null,null,null,null,null,null,null,{"$f":"$AE$23","v":58}]
[]
[]
[]
[null,null,{"$f":"$AA$1","v":"32º Campeonato Brasileiro Individual"},null,null,null,null,null,null,null,{"$f":"$AB$1","v":"Categoria"},null,null,null,{"$f":"$AA$1","v":"32º Campeonato Brasileiro Individual"},null,null,null,null,null,null,null,{"$f":"$AB$1","v":"Categoria"}]
[null,null,{"$f":"$AA$24","v":"1a Fase"},null,null,null,null,null,null,null,{"$f":"$AB$24","v":"SUB-18"},null,null,null,{"$f":"$AA$25","v":"1a Fase"},null,null,null,null,null,null,null,{"$f":"$AB$25","v":"SUB-18"}]
[]
[1,null,"Grupo",null,{"$f":"$AF$24","v":"RODRIGO (PE)"},null,null,null,null,null,null,null,null,null,"Grupo",null,{"$f":"$AF$25","v":"DANIEL COUTO (RJ)"}]
[1,null,{"$f":"$AC$24","v":1},null,null,null,null,null,null,null,null,null,null,null,{"$f":"$AC$25","v":1}]
[]
[]
[null,null,"Rodada",null,null,null,null,null,null,null,null,null,null,null,"Rodada"]
[null,null,{"$f":"$AD$24","v":3},null,null,null,null,null,null,null,null,null,null,null,{"$f":"$AD$25","v":3}]
[1,null,null,null,{"$f":"$AG$24","v":"LINNO BALA (PE)"},null,null,null,null,null,null,null,null,null,null,null,{"$f":"$AG$25","v":"VERISSON (PE)"}]
[1]
[null,null,"Mesa",null,null,null,null,null,null,null,null,null,null,null,"Mesa"]
[null,null,{"$f":"$AE$24","v":60},null,null,null,null,null,null,null,null,null,null,null,{"$f":"$AE$25","v":61}]
[]
[]
[]
[null,null,{"$f":"$AA$1","v":"32º Campeonato Brasileiro Individual"},null,null,null,null,null,null,null,{"$f":"$AB$1","v":"Categoria"},null,null,null,{"$f":"$AA$1","v":"32º Campeonato Brasileiro Individual"},null,null,null,null,null,null,null,{"$f":"$AB$1","v":"Categoria"}]
[null,null,{"$f":"$AA$26","v":"1a Fase"},null,null,null,null,null,null,null,{"$f":"$AB$26","v":"SUB-18"},null,null,null,{"$f":"$AA$27","v":"1a Fase"},null,null,null,null,null,null,null,{"$f":"$AB$27","v":"SUB-18"}]
[]
[1,null,"Grupo",null,{"$f":"$AF$26","v":"LEO LIMA (SP)"},null,null,null,null,null,null,null,null,null,"Grupo",null,{"$f":"$AF$27","v":"PEDRO ANTONIO (SP)"}]
[1,null,{"$f":"$AC$26","v":1},null,null,null,null,null,null,null,null,null,null,null,{"$f":"$AC$27","v":1}]
[]
[]
[null,null,"Rodada",null,null,null,null,null,null,null,null,null,null,null,"Rodada"]
[null,null,{"$f":"$AD$26","v":4},null,null,null,null,null,null,null,null,null,null,null,{"$f":"$AD$27","v":4}]
[1,null,null,null,{"$f":"$AG$26","v":"IGOR COSTA (SP)"},null,null,null,null,null,null,null,null,null,null,null,{"$f":"$AG$27","v":"VITOR HUGO (SP)"}]
[1]
[null,null,"Mesa",null,null,null,null,null,null,null,null,null,null,null,"Mesa"]
[null,null,{"$f":"$AE$26","v":58},null,null,null,null,null,null,null,null,null,null,null,{"$f":"$AE$27","v":57}]
[]
[]
[]
[null,null,{"$f":"$AA$1","v":"32º Campeonato Brasileiro Individual"},null,null,null,null,null,null,null,{"$f":"$AB$1","v":"Categoria"},null,null,null,{"$f":"$AA$1","v":"32º Campeonato Brasileiro Individual"},null,null,null,null,null,null,null,{"$f":"$AB$1","v":"Categoria"}]
[null,null,{"$f":"$AA$28","v":"1a Fase"},null,null,null,null,null,null,null,{"$f":"$AB$28","v":"SUB-18"},null,null,null,{"$f":"$AA$29","v":"1a Fase"},null,null,null,null,null,null,null,{"$f":"$AB$29","v":"SUB-18"}]
[]
[1,null,"Grupo",null,{"$f":"$AF$28","v":"TUGUINHA (SP)"},null,null,null,null,null,null,null,null,null,"Grupo",null,{"$f":"$AF$29","v":"CAROL (SP)"}]
[1,null,{"$f":"$AC$28","v":1},null,null,null,null,null,null,null,null,null,null,null,{"$f":"$AC$29","v":1}]
[]
[]
[null,null,"Rodada",null,null,null,null,null,null,null,null,null,null,null,"Rodada"]
[null,null,{"$f":"$AD$28","v":4},null,null,null,null,null,null,null,null,null,null,null,{"$f":"$AD$29","v":4}]
[1,null,null,null,{"$f":"$AG$28","v":"TUSURINHA (SP)"},null,null,null,null,null,null,null,null,null,null,null,{"$f":"$AG$29","v":"LUIZ GULHERME (SP)"}]
[1]
[null,null,"Mesa",null,null,null,null,null,null,null,null,null,null,null,"Mesa"]
[null,null,{"$f":"$AE$28","v":59},null,null,null,null,null,null,null,null,null,null,null,{"$f":"$AE$29","v":60}]
[]
[]
[]
[null,null,{"$f":"$AA$1","v":"32º Campeonato Brasileiro Individual"},null,null,null,null,null,null,null,{"$f":"$AB$1","v":"Categoria"},null,null,null,{"$f":"$AA$1","v":"32º Campeonato Brasileiro Individual"},null,null,null,null,null,null,null,{"$f":"$AB$1","v":"Categoria"}]
[null,null,{"$f":"$AA$30","v":"1a Fase"},null,null,null,null,null,null,null,{"$f":"$AB$30","v":"SUB-18"},null,null,null,{"$f":"$AA$31","v":"1a Fase"},null,null,null,null,null,null,null,{"$f":"$AB$31","v":"SUB-18"}]
[]
[1,null,"Grupo",null,{"$f":"$AF$30","v":"PEDRINHO (SP)"},null,null,null,null,null,null,null,null,null,"Grupo",null,{"$f":"$AF$31","v":"WALLACE RINCO (SP)"}]
[1,null,{"$f":"$AC$30","v":1},null,null,null,null,null,null,null,null,null,null,null,{"$f":"$AC$31","v":1}]
[]
[]
[null,null,"Rodada",null,null,null,null,null,null,null,null,null,null,null,"Rodada"]
[null,null,{"$f":"$AD$30","v":4},null,null,null,null,null,null,null,null,null,null,null,{"$f":"$AD$31","v":4}]
[1,null,null,null,{"$f":"$AG$30","v":"RODRIGO (PE)"},null,null,null,null,null,null,null,null,null,null,null,{"$f":"$AG$31","v":"LINNO BALA (PE)"}]
[1]
[null,null,"Mesa",null,null,null,null,null,null,null,null,null,null,null,"Mesa"]
[null,null,{"$f":"$AE$30","v":62},null,null,null,null,null,null,null,null,null,null,null,{"$f":"$AE$31","v":61}]
[]
[]
[]
[null,null,{"$f":"$AA$1","v":"32º Campeonato Brasileiro Individual"},null,null,null,null,null,null,null,{"$f":"$AB$1","v":"Categoria"},null,null,null,{"$f":"$AA$1","v":"32º Campeonato Brasileiro Individual"},null,null,null,null,null,null,null,{"$f":"$AB$1","v":"Categoria"}]
[null,null,{"$f":"$AA$32","v":"1a Fase"},null,null,null,null,null,null,null,{"$f":"$AB$32","v":"SUB-18"},null,null,null,{"$f":"$AA$33","v":"1a Fase"},null,null,null,null,null,null,null,{"$f":"$AB$33","v":"SUB-18"}]
[]
[1,null,"Grupo",null,{"$f":"$AF$32","v":"DAVI ANDRADE (SP)"},null,null,null,null,null,null,null,null,null,"Grupo",null,{"$f":"$AF$33","v":"MELLI JR (SP)"}]
[1,null,{"$f":"$AC$32","v":1},null,null,null,null,null,null,null,null,null,null,null,{"$f":"$AC$33","v":1}]
[]
[]
[null,null,"Rodada",null,null,null,null,null,null,null,null,null,null,null,"Rodada"]
[null,null,{"$f":"$AD$32","v":4},null,null,null,null,null,null,null,null,null,null,null,{"$f":"$AD$33","v":4}]
[1,null,null,null,{"$f":"$AG$32","v":"DANIEL COUTO (RJ)"},null,null,null,null,null,null,null,null,null,null,null,{"$f":"$AG$33","v":"VERISSON (PE)"}]
[1]
[null,null,"Mesa",null,null,null,null,null,null,null,null,null,null,null,"Mesa"]
[null,null,{"$f":"$AE$32","v":64},null,null,null,null,null,null,null,null,null,null,null,{"$f":"$AE$33","v":63}]
[]
[]
[]
[null,null,{"$f":"$AA$1","v":"32º Campeonato Brasileiro Individual"},null,null,null,null,null,null,null,{"$f":"$AB$1","v":"Categoria"},null,null,null,{"$f":"$AA$1","v":"32º Campeonato Brasileiro Individual"},null,null,null,null,null,null,null,{"$f":"$AB$1","v":"Categoria"}]
[null,null,{"$f":"$AA$34","v":"1a Fase"},null,null,null,null,null,null,null,{"$f":"$AB$34","v":"SUB-18"},null,null,null,{"$f":"$AA$35","v":"1a Fase"},null,null,null,null,null,null,null,{"$f":"$AB$35","v":"SUB-18"}]
[]
[1,null,"Grupo",null,{"$f":"$AF$34","v":"LEO LIMA (SP)"},null,null,null,null,null,null,null,null,null,"Grupo",null,{"$f":"$AF$35","v":"PEDRO ANTONIO (SP)"}]
[1,null,{"$f":"$AC$34","v":1},null,null,null,null,null,null,null,null,null,null,null,{"$f":"$AC$35","v":1}]
[]
[]
[null,null,"Rodada",null,null,null,null,null,null,null,null,null,null,null,"Rodada"]
[null,null,{"$f":"$AD$34","v":5},null,null,null,null,null,null,null,null,null,null,null,{"$f":"$AD$35","v":5}]
[1,null,null,null,{"$f":"$AG$34","v":"VITOR HUGO (SP)"},null,null,null,null,null,null,null,null,null,null,null,{"$f":"$AG$35","v":"TUSURINHA (SP)"}]
[1]
[null,null,"Mesa",null,null,null,null,null,null,null,null,null,null,null,"Mesa"]
[null,null,{"$f":"$AE$34","v":60},null,null,null,null,null,null,null,null,null,null,null,{"$f":"$AE$35","v":61}]
[]
[]
[]
[null,null,{"$f":"$AA$1","v":"32º Campeonato Brasileiro Individual"},null,null,null,null,null,null,null,{"$f":"$AB$1","v":"Categoria"},null,null,null,{"$f":"$AA$1","v":"32º Campeonato Brasileiro Individual"},null,null,null,null,null,null,null,{"$f":"$AB$1","v":"Categoria"}]
[null,null,{"$f":"$AA$36","v":"1a Fase"},null,null,null,null,null,null,null,{"$f":"$AB$36","v":"SUB-18"},null,null,null,{"$f":"$AA$37","v":"1a Fase"},null,null,null,null,null,null,null,{"$f":"$AB$37","v":"SUB-18"}]
[]
[1,null,"Grupo",null,{"$f":"$AF$36","v":"TUGUINHA (SP)"},null,null,null,null,null,null,null,null,null,"Grupo",null,{"$f":"$AF$37","v":"CAROL (SP)"}]
[1,null,{"$f":"$AC$36","v":1},null,null,null,null,null,null,null,null,null,null,null,{"$f":"$AC$37","v":1}]
[]
[]
[null,null,"Rodada",null,null,null,null,null,null,null,null,null,null,null,"Rodada"]
[null,null,{"$f":"$AD$36","v":5},null,null,null,null,null,null,null,null,null,null,null,{"$f":"$AD$37","v":5}]
[1,null,null,null,{"$f":"$AG$36","v":"LUIZ GULHERME (SP)"},null,null,null,null,null,null,null,null,null,null,null,{"$f":"$AG$37","v":"IGOR COSTA (SP)"}]
[1]
[null,null,"Mesa",null,null,null,null,null,null,null,null,null,null,null,"Mesa"]
[null,null,{"$f":"$AE$36","v":62},null,null,null,null,null,null,null,null,null,null,null,{"$f":"$AE$37","v":63}]
[]
[]
[]
[null,null,{"$f":"$AA$1","v":"32º Campeonato Brasileiro Individual"},null,null,null,null,null,null,null,{"$f":"$AB$1","v":"Categoria"},null,null,null,{"$f":"$AA$1","v":"32º Campeonato Brasileiro Individual"},null,null,null,null,null,null,null,{"$f":"$AB$1","v":"Categoria"}]
[null,null,{"$f":"$AA$38","v":"1a Fase"},null,null,null,null,null,null,null,{"$f":"$AB$38","v":"SUB-18"},null,null,null,{"$f":"$AA$39","v":"1a Fase"},null,null,null,null,null,null,null,{"$f":"$AB$39","v":"SUB-18"}]
[]
[1,null,"Grupo",null,{"$f":"$AF$38","v":"PEDRINHO (SP)"},null,null,null,null,null,null,null,null,null,"Grupo",null,{"$f":"$AF$39","v":"WALLACE RINCO (SP)"}]
[1,null,{"$f":"$AC$38","v":1},null,null,null,null,null,null,null,null,null,null,null,{"$f":"$AC$39","v":1}]
[]
[]
[null,null,"Rodada",null,null,null,null,null,null,null,null,null,null,null,"Rodada"]
[null,null,{"$f":"$AD$38","v":5},null,null,null,null,null,null,null,null,null,null,null,{"$f":"$AD$39","v":5}]
[1,null,null,null,{"$f":"$AG$38","v":"LINNO BALA (PE)"},null,null,null,null,null,null,null,null,null,null,null,{"$f":"$AG$39","v":"DANIEL COUTO (RJ)"}]
[1]
[null,null,"Mesa",null,null,null,null,null,null,null,null,null,null,null,"Mesa"]
[null,null,{"$f":"$AE$38","v":64},null,null,null,null,null,null,null,null,null,null,null,{"$f":"$AE$39","v":58}]
[]
[]
[]
[null,null,{"$f":"$AA$1","v":"32º Campeonato Brasileiro Individual"},null,null,null,null,null,null,null,{"$f":"$AB$1","v":"Categoria"},null,null,null,{"$f":"$AA$1","v":"32º Campeonato Brasileiro Individual"},null,null,null,null,null,null,null,{"$f":"$AB$1","v":"Categoria"}]
[null,null,{"$f":"$AA$40","v":"1a Fase"},null,null,null,null,null,null,null,{"$f":"$AB$40","v":"SUB-18"},null,null,null,{"$f":"$AA$41","v":"1a Fase"},null,null,null,null,null,null,null,{"$f":"$AB$41","v":"SUB-18"}]
[]
[1,null,"Grupo",null,{"$f":"$AF$40","v":"DAVI ANDRADE (SP)"},null,null,null,null,null,null,null,null,null,"Grupo",null,{"$f":"$AF$41","v":"MELLI JR (SP)"}]
[1,null,{"$f":"$AC$40","v":1},null,null,null,null,null,null,null,null,null,null,null,{"$f":"$AC$41","v":1}]
[]
[]
[null,null,"Rodada",null,null,null,null,null,null,null,null,null,null,null,"Rodada"]
[null,null,{"$f":"$AD$40","v":5},null,null,null,null,null,null,null,null,null,null,null,{"$f":"$AD$41","v":5}]
[1,null,null,null,{"$f":"$AG$40","v":"VERISSON (PE)"},null,null,null,null,null,null,null,null,null,null,null,{"$f":"$AG$41","v":"RODRIGO (PE)"}]
[1]
[null,null,"Mesa",null,null,null,null,null,null,null,null,null,null,null,"Mesa"]
[null,null,{"$f":"$AE$40","v":57},null,null,null,null,null,null,null,null,null,null,null,{"$f":"$AE$41","v":59}]
[]
[]
[]
[null,null,{"$f":"$AA$1","v":"32º Campeonato Brasileiro Individual"},null,null,null,null,null,null,null,{"$f":"$AB$1","v":"Categoria"},null,null,null,{"$f":"$AA$1","v":"32º Campeonato Brasileiro Individual"},null,null,null,null,null,null,null,{"$f":"$AB$1","v":"Categoria"}]
[null,null,{"$f":"$AA$42","v":"1a Fase"},null,null,null,null,null,null,null,{"$f":"$AB$42","v":"SUB-18"},null,null,null,{"$f":"$AA$43","v":"1a Fase"},null,null,null,null,null,null,null,{"$f":"$AB$43","v":"SUB-18"}]
[]
[1,null,"Grupo",null,{"$f":"$AF$42","v":"LEO LIMA (SP)"},null,null,null,null,null,null,null,null,null,"Grupo",null,{"$f":"$AF$43","v":"PEDRO ANTONIO (SP)"}]
[1,null,{"$f":"$AC$42","v":1},null,null,null,null,null,null,null,null,null,null,null,{"$f":"$AC$43","v":1}]
[]
[]
[null,null,"Rodada",null,null,null,null,null,null,null,null,null,null,null,"Rodada"]
[null,null,{"$f":"$AD$42","v":6},null,null,null,null,null,null,null,null,null,null,null,{"$f":"$AD$43","v":6}]
[1,null,null,null,{"$f":"$AG$42","v":"TUSURINHA (SP)"},null,null,null,null,null,null,null,null,null,null,null,{"$f":"$AG$43","v":"LUIZ GULHERME (SP)"}]
[1]
[null,null,"Mesa",null,null,null,null,null,null,null,null,null,null,null,"Mesa"]
[null,null,{"$f":"$AE$42","v":62},null,null,null,null,null,null,null,null,null,null,null,{"$f":"$AE$43","v":64}]
[]
[]
[]
[null,null,{"$f":"$AA$1","v":"32º Campeonato Brasileiro Individual"},null,null,null,null,null,null,null,{"$f":"$AB$1","v":"Categoria"},null,null,null,{"$f":"$AA$1","v":"32º Campeonato Brasileiro Individual"},null,null,null,null,null,null,null,{"$f":"$AB$1","v":"Categoria"}]
[null,null,{"$f":"$AA$44","v":"1a Fase"},null,null,null,null,null,null,null,{"$f":"$AB$44","v":"SUB-18"},null,null,null,{"$f":"$AA$45","v":"1a Fase"},null,null,null,null,null,null,null,{"$f":"$AB$45","v":"SUB-18"}]
[]
[1,null,"Grupo",null,{"$f":"$AF$44","v":"TUGUINHA (SP)"},null,null,null,null,null,null,null,null,null,"Grupo",null,{"$f":"$AF$45","v":"CAROL (SP)"}]
[1,null,{"$f":"$AC$44","v":1},null,null,null,null,null,null,null,null,null,null,null,{"$f":"$AC$45","v":1}]
[]
[]
[null,null,"Rodada",null,null,null,null,null,null,null,null,null,null,null,"Rodada"]
[null,null,{"$f":"$AD$44","v":6},null,null,null,null,null,null,null,null,null,null,null,{"$f":"$AD$45","v":6}]
[1,null,null,null,{"$f":"$AG$44","v":"IGOR COSTA (SP)"},null,null,null,null,null,null,null,null,null,null,null,{"$f":"$AG$45","v":"VITOR HUGO (SP)"}]
[1]
[null,null,"Mesa",null,null,null,null,null,null,null,null,null,null,null,"Mesa"]
[null,null,{"$f":"$AE$44","v":57},null,null,null,null,null,null,null,null,null,null,null,{"$f":"$AE$45","v":58}]
[]
[]
[]
[null,null,{"$f":"$AA$1","v":"32º Campeonato Brasileiro Individual"},null,null,null,null,null,null,null,{"$f":"$AB$1","v":"Categoria"},null,null,null,{"$f":"$AA$1","v":"32º Campeonato Brasileiro Individual"},null,null,null,null,null,null,null,{"$f":"$AB$1","v":"Categoria"}]
[null,null,{"$f":"$AA$46","v":"1a Fase"},null,null,null,null,null,null,null,{"$f":"$AB$46","v":"SUB-18"},null,null,null,{"$f":"$AA$47","v":"1a Fase"},null,null,null,null,null,null,null,{"$f":"$AB$47","v":"SUB-18"}]
[]
[1,null,"Grupo",null,{"$f":"$AF$46","v":"PEDRINHO (SP)"},null,null,null,null,null,null,null,null,null,"Grupo",null,{"$f":"$AF$47","v":"WALLACE RINCO (SP)"}]
[1,null,{"$f":"$AC$46","v":1},null,null,null,null,null,null,null,null,null,null,null,{"$f":"$AC$47","v":1}]
[]
[]
[null,null,"Rodada",null,null,null,null,null,null,null,null,null,null,null,"Rodada"]
[null,null,{"$f":"$AD$46","v":6},null,null,null,null,null,null,null,null,null,null,null,{"$f":"$AD$47","v":6}]
[1,null,null,null,{"$f":"$AG$46","v":"DANIEL COUTO (RJ)"},null,null,null,null,null,null,null,null,null,null,null,{"$f":"$AG$47","v":"VERISSON (PE)"}]
[1]
[null,null,"Mesa",null,null,null,null,null,null,null,null,null,null,null,"Mesa"]
[null,null,{"$f":"$AE$46","v":60},null,null,null,null,null,null,null,null,null,null,null,{"$f":"$AE$47","v":59}]
[]
[]
[]
[null,null,{"$f":"$AA$1","v":"32º Campeonato Brasileiro Individual"},null,null,null,null,null,null,null,{"$f":"$AB$1","v":"Categoria"},null,null,null,{"$f":"$AA$1","v":"32º Campeonato Brasileiro Individual"},null,null,null,null,null,null,null,{"$f":"$AB$1","v":"Categoria"}]
[null,null,{"$f":"$AA$48","v":"1a Fase"},null,null,null,null,null,null,null,{"$f":"$AB$48","v":"SUB-18"},null,null,null,{"$f":"$AA$49","v":"1a Fase"},null,null,null,null,null,null,null,{"$f":"$AB$49","v":"SUB-18"}]
[]
[1,null,"Grupo",null,{"$f":"$AF$48","v":"DAVI ANDRADE (SP)"},null,null,null,null,null,null,null,null,null,"Grupo",null,{"$f":"$AF$49","v":"MELLI JR (SP)"}]
[1,null,{"$f":"$AC$48","v":1},null,null,null,null,null,null,null,null,null,null,null,{"$f":"$AC$49","v":1}]
[]
[]
[null,null,"Rodada",null,null,null,null,null,null,null,null,null,null,null,"Rodada"]
[null,null,{"$f":"$AD$48","v":6},null,null,null,null,null,null,null,null,null,null,null,{"$f":"$AD$49","v":6}]
[1,null,null,null,{"$f":"$AG$48","v":"RODRIGO (PE)"},null,null,null,null,null,null,null,null,null,null,null,{"$f":"$AG$49","v":"LINNO BALA (PE)"}]
[1]
[null,null,"Mesa",null,null,null,null,null,null,null,null,null,null,null,"Mesa"]
[null,null,{"$f":"$AE$48","v":61},null,null,null,null,null,null,null,null,null,null,null,{"$f":"$AE$49","v":63}]
[]
[]
[]
[null,null,{"$f":"$AA$1","v":"32º Campeonato Brasileiro Individual"},null,null,null,null,null,null,null,{"$f":"$AB$1","v":"Categoria"},null,null,null,{"$f":"$AA$1","v":"32º Campeonato Brasileiro Individual"},null,null,null,null,null,null,null,{"$f":"$AB$1","v":"Categoria"}]
[null,null,{"$f":"$AA$50","v":"1a Fase"},null,null,null,null,null,null,null,{"$f":"$AB$50","v":"SUB-18"},null,null,null,{"$f":"$AA$51","v":"1a Fase"},null,null,null,null,null,null,null,{"$f":"$AB$51","v":"SUB-18"}]
[]
[1,null,"Grupo",null,{"$f":"$AF$50","v":"LEO LIMA (SP)"},null,null,null,null,null,null,null,null,null,"Grupo",null,{"$f":"$AF$51","v":"PEDRO ANTONIO (SP)"}]
[1,null,{"$f":"$AC$50","v":1},null,null,null,null,null,null,null,null,null,null,null,{"$f":"$AC$51","v":1}]
[]
[]
[null,null,"Rodada",null,null,null,null,null,null,null,null,null,null,null,"Rodada"]
[null,null,{"$f":"$AD$50","v":7},null,null,null,null,null,null,null,null,null,null,null,{"$f":"$AD$51","v":7}]
[1,null,null,null,{"$f":"$AG$50","v":"LUIZ GULHERME (SP)"},null,null,null,null,null,null,null,null,null,null,null,{"$f":"$AG$51","v":"IGOR COSTA (SP)"}]
[1]
[null,null,"Mesa",null,null,null,null,null,null,null,null,null,null,null,"Mesa"]
[null,null,{"$f":"$AE$50","v":58},null,null,null,null,null,null,null,null,null,null,null,{"$f":"$AE$51","v":59}]
[]
[]
[]
[null,null,{"$f":"$AA$1","v":"32º Campeonato Brasileiro Individual"},null,null,null,null,null,null,null,{"$f":"$AB$1","v":"Categoria"},null,null,null,{"$f":"$AA$1","v":"32º Campeonato Brasileiro Individual"},null,null,null,null,null,null,null,{"$f":"$AB$1","v":"Categoria"}]
[null,null,{"$f":"$AA$52","v":"1a Fase"},null,null,null,null,null,null,null,{"$f":"$AB$52","v":"SUB-18"},null,null,null,{"$f":"$AA$53","v":"1a Fase"},null,null,null,null,null,null,null,{"$f":"$AB$53","v":"SUB-18"}]
[]
[1,null,"Grupo",null,{"$f":"$AF$52","v":"TUGUINHA (SP)"},null,null,null,null,null,null,null,null,null,"Grupo",null,{"$f":"$AF$53","v":"CAROL (SP)"}]
[1,null,{"$f":"$AC$52","v":1},null,null,null,null,null,null,null,null,null,null,null,{"$f":"$AC$53","v":1}]
[]
[]
[null,null,"Rodada",null,null,null,null,null,null,null,null,null,null,null,"Rodada"]
[null,null,{"$f":"$AD$52","v":7},null,null,null,null,null,null,null,null,null,null,null,{"$f":"$AD$53","v":7}]
[1,null,null,null,{"$f":"$AG$52","v":"VITOR HUGO (SP)"},null,null,null,null,null,null,null,null,null,null,null,{"$f":"$AG$53","v":"TUSURINHA (SP)"}]
[1]
[null,null,"Mesa",null,null,null,null,null,null,null,null,null,null,null,"Mesa"]
[null,null,{"$f":"$AE$52","v":64},null,null,null,null,null,null,null,null,null,null,null,{"$f":"$AE$53","v":61}]
[]
[]
[]
[null,null,{"$f":"$AA$1","v":"32º Campeonato Brasileiro Individual"},null,null,null,null,null,null,null,{"$f":"$AB$1","v":"Categoria"},null,null,null,{"$f":"$AA$1","v":"32º Campeonato Brasileiro Individual"},null,null,null,null,null,null,null,{"$f":"$AB$1","v":"Categoria"}]
[null,null,{"$f":"$AA$54","v":"1a Fase"},null,null,null,null,null,null,null,{"$f":"$AB$54","v":"SUB-18"},null,null,null,{"$f":"$AA$55","v":"1a Fase"},null,null,null,null,null,null,null,{"$f":"$AB$55","v":"SUB-18"}]
[]
[1,null,"Grupo",null,{"$f":"$AF$54","v":"PEDRINHO (SP)"},null,null,null,null,null,null,null,null,null,"Grupo",null,{"$f":"$AF$55","v":"WALLACE RINCO (SP)"}]
[1,null,{"$f":"$AC$54","v":1},null,null,null,null,null,null,null,null,null,null,null,{"$f":"$AC$55","v":1}]
[]
[]
[null,null,"Rodada",null,null,null,null,null,null,null,null,null,null,null,"Rodada"]
[null,null,{"$f":"$AD$54","v":7},null,null,null,null,null,null,null,null,null,null,null,{"$f":"$AD$55","v":7}]
[1,null,null,null,{"$f":"$AG$54","v":"VERISSON (PE)"},null,null,null,null,null,null,null,null,null,null,null,{"$f":"$AG$55","v":"RODRIGO (PE)"}]
[1]
[null,null,"Mesa",null,null,null,null,null,null,null,null,null,null,null,"Mesa"]
[null,null,{"$f":"$AE$54","v":57},null,null,null,null,null,null,null,null,null,null,null,{"$f":"$AE$55","v":63}]
[]
[]
[]
[null,null,{"$f":"$AA$1","v":"32º Campeonato Brasileiro Individual"},null,null,null,null,null,null,null,{"$f":"$AB$1","v":"Categoria"},null,null,null,{"$f":"$AA$1","v":"32º Campeonato Brasileiro Individual"},null,null,null,null,null,null,null,{"$f":"$AB$1","v":"Categoria"}]
[null,null,{"$f":"$AA$56","v":"1a Fase"},null,null,null,null,null,null,null,{"$f":"$AB$56","v":"SUB-18"},null,null,null,{"$f":"$AA$57","v":"1a Fase"},null,null,null,null,null,null,null,{"$f":"$AB$57","v":"SUB-18"}]
[]
[1,null,"Grupo",null,{"$f":"$AF$56","v":"DAVI ANDRADE (SP)"},null,null,null,null,null,null,null,null,null,"Grupo",null,{"$f":"$AF$57","v":"MELLI JR (SP)"}]
[1,null,{"$f":"$AC$56","v":1},null,null,null,null,null,null,null,null,null,null,null,{"$f":"$AC$57","v":1}]
[]
[]
[null,null,"Rodada",null,null,null,null,null,null,null,null,null,null,null,"Rodada"]
[null,null,{"$f":"$AD$56","v":7},null,null,null,null,null,null,null,null,null,null,null,{"$f":"$AD$57","v":7}]
[1,null,null,null,{"$f":"$AG$56","v":"LINNO BALA (PE)"},null,null,null,null,null,null,null,null,null,null,null,{"$f":"$AG$57","v":"DANIEL COUTO (RJ)"}]
[1]
[null,null,"Mesa",null,null,null,null,null,null,null,null,null,null,null,"Mesa"]
[null,null,{"$f":"$AE$56","v":60},null,null,null,null,null,null,null,null,null,null,null,{"$f":"$AE$57","v":62}]
[]
[]
[]
[null,null,{"$f":"$AA$1","v":"32º Campeonato Brasileiro Individual"},null,null,null,null,null,null,null,{"$f":"$AB$1","v":"Categoria"},null,null,null,{"$f":"$AA$1","v":"32º Campeonato Brasileiro Individual"},null,null,null,null,null,null,null,{"$f":"$AB$1","v":"Categoria"}]
[null,null,{"$f":"$AA$58","v":"1a Fase"},null,null,null,null,null,null,null,{"$f":"$AB$58","v":"SUB-18"},null,null,null,{"$f":"$AA$59","v":"1a Fase"},null,null,null,null,null,null,null,{"$f":"$AB$59","v":"SUB-18"}]
[]
[1,null,"Grupo",null,{"$f":"$AF$58","v":"LEO LIMA (SP)"},null,null,null,null,null,null,null,null,null,"Grupo",null,{"$f":"$AF$59","v":"PEDRO ANTONIO (SP)"}]
[1,null,{"$f":"$AC$58","v":1},null,null,null,null,null,null,null,null,null,null,null,{"$f":"$AC$59","v":1}]
[]
[]
[null,null,"Rodada",null,null,null,null,null,null,null,null,null,null,null,"Rodada"]
[null,null,{"$f":"$AD$58","v":8},null,null,null,null,null,null,null,null,null,null,null,{"$f":"$AD$59","v":8}]
[1,null,null,null,{"$f":"$AG$58","v":"PEDRINHO (SP)"},null,null,null,null,null,null,null,null,null,null,null,{"$f":"$AG$59","v":"WALLACE RINCO (SP)"}]
[1]
[null,null,"Mesa",null,null,null,null,null,null,null,null,null,null,null,"Mesa"]
[null,null,{"$f":"$AE$58","v":61},null,null,null,null,null,null,null,null,null,null,null,{"$f":"$AE$59","v":62}]
[]
[]
[]
[null,null,{"$f":"$AA$1","v":"32º Campeonato Brasileiro Individual"},null,null,null,null,null,null,null,{"$f":"$AB$1","v":"Categoria"},null,null,null,{"$f":"$AA$1","v":"32º Campeonato Brasileiro Individual"},null,null,null,null,null,null,null,{"$f":"$AB$1","v":"Categoria"}]
[null,null,{"$f":"$AA$60","v":"1a Fase"},null,null,null,null,null,null,null,{"$f":"$AB$60","v":"SUB-18"},null,null,null,{"$f":"$AA$61","v":"1a Fase"},null,null,null,null,null,null,null,{"$f":"$AB$61","v":"SUB-18"}]
[]
[1,null,"Grupo",null,{"$f":"$AF$60","v":"TUGUINHA (SP)"},null,null,null,null,null,null,null,null,null,"Grupo",null,{"$f":"$AF$61","v":"CAROL (SP)"}]
[1,null,{"$f":"$AC$60","v":1},null,null,null,null,null,null,null,null,null,null,null,{"$f":"$AC$61","v":1}]
[]
[]
[null,null,"Rodada",null,null,null,null,null,null,null,null,null,null,null,"Rodada"]
[null,null,{"$f":"$AD$60","v":8},null,null,null,null,null,null,null,null,null,null,null,{"$f":"$AD$61","v":8}]
[1,null,null,null,{"$f":"$AG$60","v":"DAVI ANDRADE (SP)"},null,null,null,null,null,null,null,null,null,null,null,{"$f":"$AG$61","v":"MELLI JR (SP)"}]
[1]
[null,null,"Mesa",null,null,null,null,null,null,null,null,null,null,null,"Mesa"]
[null,null,{"$f":"$AE$60","v":63},null,null,null,null,null,null,null,null,null,null,null,{"$f":"$AE$61","v":64}]
[]
[]
[]
[null,null,{"$f":"$AA$1","v":"32º Campeonato Brasileiro Individual"},null,null,null,null,null,null,null,{"$f":"$AB$1","v":"Categoria"},null,null,null,{"$f":"$AA$1","v":"32º Campeonato Brasileiro Individual"},null,null,null,null,null,null,null,{"$f":"$AB$1","v":"Categoria"}]
[null,null,{"$f":"$AA$62","v":"1a Fase"},null,null,null,null,null,null,null,{"$f":"$AB$62","v":"SUB-18"},null,null,null,{"$f":"$AA$63","v":"1a Fase"},null,null,null,null,null,null,null,{"$f":"$AB$63","v":"SUB-18"}]
[]
[1,null,"Grupo",null,{"$f":"$AF$62","v":"IGOR COSTA (SP)"},null,null,null,null,null,null,null,null,null,"Grupo",null,{"$f":"$AF$63","v":"VITOR HUGO (SP)"}]
[1,null,{"$f":"$AC$62","v":1},null,null,null,null,null,null,null,null,null,null,null,{"$f":"$AC$63","v":1}]
[]
[]
[null,null,"Rodada",null,null,null,null,null,null,null,null,null,null,null,"Rodada"]
[null,null,{"$f":"$AD$62","v":8},null,null,null,null,null,null,null,null,null,null,null,{"$f":"$AD$63","v":8}]
[1,null,null,null,{"$f":"$AG$62","v":"RODRIGO (PE)"},null,null,null,null,null,null,null,null,null,null,null,{"$f":"$AG$63","v":"LINNO BALA (PE)"}]
[1]
[null,null,"Mesa",null,null,null,null,null,null,null,null,null,null,null,"Mesa"]
[null,null,{"$f":"$AE$62","v":57},null,null,null,null,null,null,null,null,null,null,null,{"$f":"$AE$63","v":58}]
[]
[]
[]
[null,null,{"$f":"$AA$1","v":"32º Campeonato Brasileiro Individual"},null,null,null,null,null,null,null,{"$f":"$AB$1","v":"Categoria"},null,null,null,{"$f":"$AA$1","v":"32º Campeonato Brasileiro Individual"},null,null,null,null,null,null,null,{"$f":"$AB$1","v":"Categoria"}]
[null,null,{"$f":"$AA$64","v":"1a Fase"},null,null,null,null,null,null,null,{"$f":"$AB$64","v":"SUB-18"},null,null,null,{"$f":"$AA$65","v":"1a Fase"},null,null,null,null,null,null,null,{"$f":"$AB$65","v":"SUB-18"}]
[]
[1,null,"Grupo",null,{"$f":"$AF$64","v":"TUSURINHA (SP)"},null,null,null,null,null,null,null,null,null,"Grupo",null,{"$f":"$AF$65","v":"LUIZ GULHERME (SP)"}]
[1,null,{"$f":"$AC$64","v":1},null,null,null,null,null,null,null,null,null,null,null,{"$f":"$AC$65","v":1}]
[]
[]
[null,null,"Rodada",null,null,null,null,null,null,null,null,null,null,null,"Rodada"]
[null,null,{"$f":"$AD$64","v":8},null,null,null,null,null,null,null,null,null,null,null,{"$f":"$AD$65","v":8}]
[1,null,null,null,{"$f":"$AG$64","v":"DANIEL COUTO (RJ)"},null,null,null,null,null,null,null,null,null,null,null,{"$f":"$AG$65","v":"VERISSON (PE)"}]
[1]
[null,null,"Mesa",null,null,null,null,null,null,null,null,null,null,null,"Mesa"]
[null,null,{"$f":"$AE$64","v":59},null,null,null,null,null,null,null,null,null,null,null,{"$f":"$AE$65","v":60}]
[]
[]
[]
[null,null,{"$f":"$AA$1","v":"32º Campeonato Brasileiro Individual"},null,null,null,null,null,null,null,{"$f":"$AB$1","v":"Categoria"},null,null,null,{"$f":"$AA$1","v":"32º Campeonato Brasileiro Individual"},null,null,null,null,null,null,null,{"$f":"$AB$1","v":"Categoria"}]
[null,null,{"$f":"$AA$66","v":"1a Fase"},null,null,null,null,null,null,null,{"$f":"$AB$66","v":"SUB-18"},null,null,null,{"$f":"$AA$67","v":"1a Fase"},null,null,null,null,null,null,null,{"$f":"$AB$67","v":"SUB-18"}]
[]
[1,null,"Grupo",null,{"$f":"$AF$66","v":"LEO LIMA (SP)"},null,null,null,null,null,null,null,null,null,"Grupo",null,{"$f":"$AF$67","v":"PEDRO ANTONIO (SP)"}]
[1,null,{"$f":"$AC$66","v":1},null,null,null,null,null,null,null,null,null,null,null,{"$f":"$AC$67","v":1}]
[]
[]
[null,null,"Rodada",null,null,null,null,null,null,null,null,null,null,null,"Rodada"]
[null,null,{"$f":"$AD$66","v":9},null,null,null,null,null,null,null,null,null,null,null,{"$f":"$AD$67","v":9}]
[1,null,null,null,{"$f":"$AG$66","v":"WALLACE RINCO (SP)"},null,null,null,null,null,null,null,null,null,null,null,{"$f":"$AG$67","v":"DAVI ANDRADE (SP)"}]
[1]
[null,null,"Mesa",null,null,null,null,null,null,null,null,null,null,null,"Mesa"]
[null,null,{"$f":"$AE$66","v":57},null,null,null,null,null,null,null,null,null,null,null,{"$f":"$AE$67","v":58}]
[]
[]
[]
[null,null,{"$f":"$AA$1","v":"32º Campeonato Brasileiro Individual"},null,null,null,null,null,null,null,{"$f":"$AB$1","v":"Categoria"},null,null,null,{"$f":"$AA$1","v":"32º Campeonato Brasileiro Individual"},null,null,null,null,null,null,null,{"$f":"$AB$1","v":"Categoria"}]
[null,null,{"$f":"$AA$68","v":"1a Fase"},null,null,null,null,null,null,null,{"$f":"$AB$68","v":"SUB-18"},null,null,null,{"$f":"$AA$69","v":"1a Fase"},null,null,null,null,null,null,null,{"$f":"$AB$69","v":"SUB-18"}]
[]
[1,null,"Grupo",null,{"$f":"$AF$68","v":"TUGUINHA (SP)"},null,null,null,null,null,null,null,null,null,"Grupo",null,{"$f":"$AF$69","v":"CAROL (SP)"}]
[1,null,{"$f":"$AC$68","v":1},null,null,null,null,null,null,null,null,null,null,null,{"$f":"$AC$69","v":1}]
[]
[]
[null,null,"Rodada",null,null,null,null,null,null,null,null,null,null,null,"Rodada"]
[null,null,{"$f":"$AD$68","v":9},null,null,null,null,null,null,null,null,null,null,null,{"$f":"$AD$69","v":9}]
[1,null,null,null,{"$f":"$AG$68","v":"MELLI JR (SP)"},null,null,null,null,null,null,null,null,null,null,null,{"$f":"$AG$69","v":"RODRIGO (PE)"}]
[1]
[null,null,"Mesa",null,null,null,null,null,null,null,null,null,null,null,"Mesa"]
[null,null,{"$f":"$AE$68","v":59},null,null,null,null,null,null,null,null,null,null,null,{"$f":"$AE$69","v":60}]
[]
[]
[]
[null,null,{"$f":"$AA$1","v":"32º Campeonato Brasileiro Individual"},null,null,null,null,null,null,null,{"$f":"$AB$1","v":"Categoria"},null,null,null,{"$f":"$AA$1","v":"32º Campeonato Brasileiro Individual"},null,null,null,null,null,null,null,{"$f":"$AB$1","v":"Categoria"}]
[null,null,{"$f":"$AA$70","v":"1a Fase"},null,null,null,null,null,null,null,{"$f":"$AB$70","v":"SUB-18"},null,null,null,{"$f":"$AA$71","v":"1a Fase"},null,null,null,null,null,null,null,{"$f":"$AB$71","v":"SUB-18"}]
[]
[1,null,"Grupo",null,{"$f":"$AF$70","v":"IGOR COSTA (SP)"},null,null,null,null,null,null,null,null,null,"Grupo",null,{"$f":"$AF$71","v":"VITOR HUGO (SP)"}]
[1,null,{"$f":"$AC$70","v":1},null,null,null,null,null,null,null,null,null,null,null,{"$f":"$AC$71","v":1}]
[]
[]
[null,null,"Rodada",null,null,null,null,null,null,null,null,null,null,null,"Rodada"]
[null,null,{"$f":"$AD$70","v":9},null,null,null,null,null,null,null,null,null,null,null,{"$f":"$AD$71","v":9}]
[1,null,null,null,{"$f":"$AG$70","v":"LINNO BALA (PE)"},null,null,null,null,null,null,null,null,null,null,null,{"$f":"$AG$71","v":"DANIEL COUTO (RJ)"}]
[1]
[null,null,"Mesa",null,null,null,null,null,null,null,null,null,null,null,"Mesa"]
[null,null,{"$f":"$AE$70","v":61},null,null,null,null,null,null,null,null,null,null,null,{"$f":"$AE$71","v":62}]
[]
[]
[]
[null,null,{"$f":"$AA$1","v":"32º Campeonato Brasileiro Individual"},null,null,null,null,null,null,null,{"$f":"$AB$1","v":"Categoria"},null,null,null,{"$f":"$AA$1","v":"32º Campeonato Brasileiro Individual"},null,null,null,null,null,null,null,{"$f":"$AB$1","v":"Categoria"}]
[null,null,{"$f":"$AA$72","v":"1a Fase"},null,null,null,null,null,null,null,{"$f":"$AB$72","v":"SUB-18"},null,null,null,{"$f":"$AA$73","v":"1a Fase"},null,null,null,null,null,null,null,{"$f":"$AB$73","v":"SUB-18"}]
[]
[1,null,"Grupo",null,{"$f":"$AF$72","v":"TUSURINHA (SP)"},null,null,null,null,null,null,null,null,null,"Grupo",null,{"$f":"$AF$73","v":"LUIZ GULHERME (SP)"}]
[1,null,{"$f":"$AC$72","v":1},null,null,null,null,null,null,null,null,null,null,null,{"$f":"$AC$73","v":1}]
[]
[]
[null,null,"Rodada",null,null,null,null,null,null,null,null,null,null,null,"Rodada"]
[null,null,{"$f":"$AD$72","v":9},null,null,null,null,null,null,null,null,null,null,null,{"$f":"$AD$73","v":9}]
[1,null,null,null,{"$f":"$AG$72","v":"VERISSON (PE)"},null,null,null,null,null,null,null,null,null,null,null,{"$f":"$AG$73","v":"PEDRINHO (SP)"}]
[1]
[null,null,"Mesa",null,null,null,null,null,null,null,null,null,null,null,"Mesa"]
[null,null,{"$f":"$AE$72","v":63},null,null,null,null,null,null,null,null,null,null,null,{"$f":"$AE$73","v":64}]
[]
[]
[]
[null,null,{"$f":"$AA$1","v":"32º Campeonato Brasileiro Individual"},null,null,null,null,null,null,null,{"$f":"$AB$1","v":"Categoria"},null,null,null,{"$f":"$AA$1","v":"32º Campeonato Brasileiro Individual"},null,null,null,null,null,null,null,{"$f":"$AB$1","v":"Categoria"}]
[null,null,{"$f":"$AA$74","v":"1a Fase"},null,null,null,null,null,null,null,{"$f":"$AB$74","v":"SUB-18"},null,null,null,{"$f":"$AA$75","v":"1a Fase"},null,null,null,null,null,null,null,{"$f":"$AB$75","v":"SUB-18"}]
[]
[1,null,"Grupo",null,{"$f":"$AF$74","v":"LEO LIMA (SP)"},null,null,null,null,null,null,null,null,null,"Grupo",null,{"$f":"$AF$75","v":"PEDRO ANTONIO (SP)"}]
[1,null,{"$f":"$AC$74","v":1},null,null,null,null,null,null,null,null,null,null,null,{"$f":"$AC$75","v":1}]
[]
[]
[null,null,"Rodada",null,null,null,null,null,null,null,null,null,null,null,"Rodada"]
[null,null,{"$f":"$AD$74","v":10},null,null,null,null,null,null,null,null,null,null,null,{"$f":"$AD$75","v":10}]
[1,null,null,null,{"$f":"$AG$74","v":"DAVI ANDRADE (SP)"},null,null,null,null,null,null,null,null,null,null,null,{"$f":"$AG$75","v":"MELLI JR (SP)"}]
[1]
[null,null,"Mesa",null,null,null,null,null,null,null,null,null,null,null,"Mesa"]
[null,null,{"$f":"$AE$74","v":59},null,null,null,null,null,null,null,null,null,null,null,{"$f":"$AE$75","v":60}]
[]
[]
[]
[null,null,{"$f":"$AA$1","v":"32º Campeonato Brasileiro Individual"},null,null,null,null,null,null,null,{"$f":"$AB$1","v":"Categoria"},null,null,null,{"$f":"$AA$1","v":"32º Campeonato Brasileiro Individual"},null,null,null,null,null,null,null,{"$f":"$AB$1","v":"Categoria"}]
[null,null,{"$f":"$AA$76","v":"1a Fase"},null,null,null,null,null,null,null,{"$f":"$AB$76","v":"SUB-18"},null,null,null,{"$f":"$AA$77","v":"1a Fase"},null,null,null,null,null,null,null,{"$f":"$AB$77","v":"SUB-18"}]
[]
[1,null,"Grupo",null,{"$f":"$AF$76","v":"TUGUINHA (SP)"},null,null,null,null,null,null,null,null,null,"Grupo",null,{"$f":"$AF$77","v":"CAROL (SP)"}]
[1,null,{"$f":"$AC$76","v":1},null,null,null,null,null,null,null,null,null,null,null,{"$f":"$AC$77","v":1}]
[]
[]
[null,null,"Rodada",null,null,null,null,null,null,null,null,null,null,null,"Rodada"]
[null,null,{"$f":"$AD$76","v":10},null,null,null,null,null,null,null,null,null,null,null,{"$f":"$AD$77","v":10}]
[1,null,null,null,{"$f":"$AG$76","v":"RODRIGO (PE)"},null,null,null,null,null,null,null,null,null,null,null,{"$f":"$AG$77","v":"LINNO BALA (PE)"}]
[1]
[null,null,"Mesa",null,null,null,null,null,null,null,null,null,null,null,"Mesa"]
[null,null,{"$f":"$AE$76","v":58},null,null,null,null,null,null,null,null,null,null,null,{"$f":"$AE$77","v":62}]
[]
[]
[]
[null,null,{"$f":"$AA$1","v":"32º Campeonato Brasileiro Individual"},null,null,null,null,null,null,null,{"$f":"$AB$1","v":"Categoria"},null,null,null,{"$f":"$AA$1","v":"32º Campeonato Brasileiro Individual"},null,null,null,null,null,null,null,{"$f":"$AB$1","v":"Categoria"}]
[null,null,{"$f":"$AA$78","v":"1a Fase"},null,null,null,null,null,null,null,{"$f":"$AB$78","v":"SUB-18"},null,null,null,{"$f":"$AA$79","v":"1a Fase"},null,null,null,null,null,null,null,{"$f":"$AB$79","v":"SUB-18"}]
[]
[1,null,"Grupo",null,{"$f":"$AF$78","v":"IGOR COSTA (SP)"},null,null,null,null,null,null,null,null,null,"Grupo",null,{"$f":"$AF$79","v":"VITOR HUGO (SP)"}]
[1,null,{"$f":"$AC$78","v":1},null,null,null,null,null,null,null,null,null,null,null,{"$f":"$AC$79","v":1}]
[]
[]
[null,null,"Rodada",null,null,null,null,null,null,null,null,null,null,null,"Rodada"]
[null,null,{"$f":"$AD$78","v":10},null,null,null,null,null,null,null,null,null,null,null,{"$f":"$AD$79","v":10}]
[1,null,null,null,{"$f":"$AG$78","v":"DANIEL COUTO (RJ)"},null,null,null,null,null,null,null,null,null,null,null,{"$f":"$AG$79","v":"VERISSON (PE)"}]
[1]
[null,null,"Mesa",null,null,null,null,null,null,null,null,null,null,null,"Mesa"]
[null,null,{"$f":"$AE$78","v":63},null,null,null,null,null,null,null,null,null,null,null,{"$f":"$AE$79","v":64}]
[]
[]
[]
[null,null,{"$f":"$AA$1","v":"32º Campeonato Brasileiro Individual"},null,null,null,null,null,null,null,{"$f":"$AB$1","v":"Categoria"},null,null,null,{"$f":"$AA$1","v":"32º Campeonato Brasileiro Individual"},null,null,null,null,null,null,null,{"$f":"$AB$1","v":"Categoria"}]
[null,null,{"$f":"$AA$80","v":"1a Fase"},null,null,null,null,null,null,null,{"$f":"$AB$80","v":"SUB-18"},null,null,null,{"$f":"$AA$81","v":"1a Fase"},null,null,null,null,null,null,null,{"$f":"$AB$81","v":"SUB-18"}]
[]
[1,null,"Grupo",null,{"$f":"$AF$80","v":"TUSURINHA (SP)"},null,null,null,null,null,null,null,null,null,"Grupo",null,{"$f":"$AF$81","v":"LUIZ GULHERME (SP)"}]
[1,null,{"$f":"$AC$80","v":1},null,null,null,null,null,null,null,null,null,null,null,{"$f":"$AC$81","v":1}]
[]
[]
[null,null,"Rodada",null,null,null,null,null,null,null,null,null,null,null,"Rodada"]
[null,null,{"$f":"$AD$80","v":10},null,null,null,null,null,null,null,null,null,null,null,{"$f":"$AD$81","v":10}]
[1,null,null,null,{"$f":"$AG$80","v":"PEDRINHO (SP)"},null,null,null,null,null,null,null,null,null,null,null,{"$f":"$AG$81","v":"WALLACE RINCO (SP)"}]
[1]
[null,null,"Mesa",null,null,null,null,null,null,null,null,null,null,null,"Mesa"]
[null,null,{"$f":"$AE$80","v":57},null,null,null,null,null,null,null,null,null,null,null,{"$f":"$AE$81","v":61}]
[]
[]
[]
[null,null,{"$f":"$AA$1","v":"32º Campeonato Brasileiro Individual"},null,null,null,null,null,null,null,{"$f":"$AB$1","v":"Categoria"},null,null,null,{"$f":"$AA$1","v":"32º Campeonato Brasileiro Individual"},null,null,null,null,null,null,null,{"$f":"$AB$1","v":"Categoria"}]
[null,null,{"$f":"$AA$82","v":"1a Fase"},null,null,null,null,null,null,null,{"$f":"$AB$82","v":"SUB-18"},null,null,null,{"$f":"$AA$83","v":"1a Fase"},null,null,null,null,null,null,null,{"$f":"$AB$83","v":"SUB-18"}]
[]
[1,null,"Grupo",null,{"$f":"$AF$82","v":"LEO LIMA (SP)"},null,null,null,null,null,null,null,null,null,"Grupo",null,{"$f":"$AF$83","v":"PEDRO ANTONIO (SP)"}]
[1,null,{"$f":"$AC$82","v":1},null,null,null,null,null,null,null,null,null,null,null,{"$f":"$AC$83","v":1}]
[]
[]
[null,null,"Rodada",null,null,null,null,null,null,null,null,null,null,null,"Rodada"]
[null,null,{"$f":"$AD$82","v":11},null,null,null,null,null,null,null,null,null,null,null,{"$f":"$AD$83","v":11}]
[1,null,null,null,{"$f":"$AG$82","v":"MELLI JR (SP)"},null,null,null,null,null,null,null,null,null,null,null,{"$f":"$AG$83","v":"RODRIGO (PE)"}]
[1]
[null,null,"Mesa",null,null,null,null,null,null,null,null,null,null,null,"Mesa"]
[null,null,{"$f":"$AE$82","v":62},null,null,null,null,null,null,null,null,null,null,null,{"$f":"$AE$83","v":63}]
[]
[]
[]
[null,null,{"$f":"$AA$1","v":"32º Campeonato Brasileiro Individual"},null,null,null,null,null,null,null,{"$f":"$AB$1","v":"Categoria"},null,null,null,{"$f":"$AA$1","v":"32º Campeonato Brasileiro Individual"},null,null,null,null,null,null,null,{"$f":"$AB$1","v":"Categoria"}]
[null,null,{"$f":"$AA$84","v":"1a Fase"},null,null,null,null,null,null,null,{"$f":"$AB$84","v":"SUB-18"},null,null,null,{"$f":"$AA$85","v":"1a Fase"},null,null,null,null,null,null,null,{"$f":"$AB$85","v":"SUB-18"}]
[]
[1,null,"Grupo",null,{"$f":"$AF$84","v":"TUGUINHA (SP)"},null,null,null,null,null,null,null,null,null,"Grupo",null,{"$f":"$AF$85","v":"CAROL (SP)"}]
[1,null,{"$f":"$AC$84","v":1},null,null,null,null,null,null,null,null,null,null,null,{"$f":"$AC$85","v":1}]
[]
[]
[null,null,"Rodada",null,null,null,null,null,null,null,null,null,null,null,"Rodada"]
[null,null,{"$f":"$AD$84","v":11},null,null,null,null,null,null,null,null,null,null,null,{"$f":"$AD$85","v":11}]
[1,null,null,null,{"$f":"$AG$84","v":"LINNO BALA (PE)"},null,null,null,null,null,null,null,null,null,null,null,{"$f":"$AG$85","v":"DANIEL COUTO (RJ)"}]
[1]
[null,null,"Mesa",null,null,null,null,null,null,null,null,null,null,null,"Mesa"]
[null,null,{"$f":"$AE$84","v":61},null,null,null,null,null,null,null,null,null,null,null,{"$f":"$AE$85","v":57}]
[]
[]
[]
[null,null,{"$f":"$AA$1","v":"32º Campeonato Brasileiro Individual"},null,null,null,null,null,null,null,{"$f":"$AB$1","v":"Categoria"},null,null,null,{"$f":"$AA$1","v":"32º Campeonato Brasileiro Individual"},null,null,null,null,null,null,null,{"$f":"$AB$1","v":"Categoria"}]
[null,null,{"$f":"$AA$86","v":"1a Fase"},null,null,null,null,null,null,null,{"$f":"$AB$86","v":"SUB-18"},null,null,null,{"$f":"$AA$87","v":"1a Fase"},null,null,null,null,null,null,null,{"$f":"$AB$87","v":"SUB-18"}]
[]
[1,null,"Grupo",null,{"$f":"$AF$86","v":"IGOR COSTA (SP)"},null,null,null,null,null,null,null,null,null,"Grupo",null,{"$f":"$AF$87","v":"VITOR HUGO (SP)"}]
[1,null,{"$f":"$AC$86","v":1},null,null,null,null,null,null,null,null,null,null,null,{"$f":"$AC$87","v":1}]
[]
[]
[null,null,"Rodada",null,null,null,null,null,null,null,null,null,null,null,"Rodada"]
[null,null,{"$f":"$AD$86","v":11},null,null,null,null,null,null,null,null,null,null,null,{"$f":"$AD$87","v":11}]
[1,null,null,null,{"$f":"$AG$86","v":"VERISSON (PE)"},null,null,null,null,null,null,null,null,null,null,null,{"$f":"$AG$87","v":"PEDRINHO (SP)"}]
[1]
[null,null,"Mesa",null,null,null,null,null,null,null,null,null,null,null,"Mesa"]
[null,null,{"$f":"$AE$86","v":58},null,null,null,null,null,null,null,null,null,null,null,{"$f":"$AE$87","v":59}]
[]
[]
[]
[null,null,{"$f":"$AA$1","v":"32º Campeonato Brasileiro Individual"},null,null,null,null,null,null,null,{"$f":"$AB$1","v":"Categoria"},null,null,null,{"$f":"$AA$1","v":"32º Campeonato Brasileiro Individual"},null,null,null,null,null,null,null,{"$f":"$AB$1","v":"Categoria"}]
[null,null,{"$f":"$AA$88","v":"1a Fase"},null,null,null,null,null,null,null,{"$f":"$AB$88","v":"SUB-18"},null,null,null,{"$f":"$AA$89","v":"1a Fase"},null,null,null,null,null,null,null,{"$f":"$AB$89","v":"SUB-18"}]
[]
[1,null,"Grupo",null,{"$f":"$AF$88","v":"TUSURINHA (SP)"},null,null,null,null,null,null,null,null,null,"Grupo",null,{"$f":"$AF$89","v":"LUIZ GULHERME (SP)"}]
[1,null,{"$f":"$AC$88","v":1},null,null,null,null,null,null,null,null,null,null,null,{"$f":"$AC$89","v":1}]
[]
[]
[null,null,"Rodada",null,null,null,null,null,null,null,null,null,null,null,"Rodada"]
[null,null,{"$f":"$AD$88","v":11},null,null,null,null,null,null,null,null,null,null,null,{"$f":"$AD$89","v":11}]
[1,null,null,null,{"$f":"$AG$88","v":"WALLACE RINCO (SP)"},null,null,null,null,null,null,null,null,null,null,null,{"$f":"$AG$89","v":"DAVI ANDRADE (SP)"}]
[1]
[null,null,"Mesa",null,null,null,null,null,null,null,null,null,null,null,"Mesa"]
[null,null,{"$f":"$AE$88","v":60},null,null,null,null,null,null,null,null,null,null,null,{"$f":"$AE$89","v":64}]
[]
[]
[]
[null,null,{"$f":"$AA$1","v":"32º Campeonato Brasileiro Individual"},null,null,null,null,null,null,null,{"$f":"$AB$1","v":"Categoria"},null,null,null,{"$f":"$AA$1","v":"32º Campeonato Brasileiro Individual"},null,null,null,null,null,null,null,{"$f":"$AB$1","v":"Categoria"}]
[null,null,{"$f":"$AA$90","v":"1a Fase"},null,null,null,null,null,null,null,{"$f":"$AB$90","v":"SUB-18"},null,null,null,{"$f":"$AA$91","v":"1a Fase"},null,null,null,null,null,null,null,{"$f":"$AB$91","v":"SUB-18"}]
[]
[1,null,"Grupo",null,{"$f":"$AF$90","v":"LEO LIMA (SP)"},null,null,null,null,null,null,null,null,null,"Grupo",null,{"$f":"$AF$91","v":"PEDRO ANTONIO (SP)"}]
[1,null,{"$f":"$AC$90","v":1},null,null,null,null,null,null,null,null,null,null,null,{"$f":"$AC$91","v":1}]
[]
[]
[null,null,"Rodada",null,null,null,null,null,null,null,null,null,null,null,"Rodada"]
[null,null,{"$f":"$AD$90","v":12},null,null,null,null,null,null,null,null,null,null,null,{"$f":"$AD$91","v":12}]
[1,null,null,null,{"$f":"$AG$90","v":"RODRIGO (PE)"},null,null,null,null,null,null,null,null,null,null,null,{"$f":"$AG$91","v":"LINNO BALA (PE)"}]
[1]
[null,null,"Mesa",null,null,null,null,null,null,null,null,null,null,null,"Mesa"]
[null,null,{"$f":"$AE$90","v":64},null,null,null,null,null,null,null,null,null,null,null,{"$f":"$AE$91","v":58}]
[]
[]
[]
[null,null,{"$f":"$AA$1","v":"32º Campeonato Brasileiro Individual"},null,null,null,null,null,null,null,{"$f":"$AB$1","v":"Categoria"},null,null,null,{"$f":"$AA$1","v":"32º Campeonato Brasileiro Individual"},null,null,null,null,null,null,null,{"$f":"$AB$1","v":"Categoria"}]
[null,null,{"$f":"$AA$92","v":"1a Fase"},null,null,null,null,null,null,null,{"$f":"$AB$92","v":"SUB-18"},null,null,null,{"$f":"$AA$93","v":"1a Fase"},null,null,null,null,null,null,null,{"$f":"$AB$93","v":"SUB-18"}]
[]
[1,null,"Grupo",null,{"$f":"$AF$92","v":"TUGUINHA (SP)"},null,null,null,null,null,null,null,null,null,"Grupo",null,{"$f":"$AF$93","v":"CAROL (SP)"}]
[1,null,{"$f":"$AC$92","v":1},null,null,null,null,null,null,null,null,null,null,null,{"$f":"$AC$93","v":1}]
[]
[]
[null,null,"Rodada",null,null,null,null,null,null,null,null,null,null,null,"Rodada"]
[null,null,{"$f":"$AD$92","v":12},null,null,null,null,null,null,null,null,null,null,null,{"$f":"$AD$93","v":12}]
[1,null,null,null,{"$f":"$AG$92","v":"DANIEL COUTO (RJ)"},null,null,null,null,null,null,null,null,null,null,null,{"$f":"$AG$93","v":"VERISSON (PE)"}]
[1]
[null,null,"Mesa",null,null,null,null,null,null,null,null,null,null,null,"Mesa"]
[null,null,{"$f":"$AE$92","v":59},null,null,null,null,null,null,null,null,null,null,null,{"$f":"$AE$93","v":60}]
[]
[]
[]
[null,null,{"$f":"$AA$1","v":"32º Campeonato Brasileiro Individual"},null,null,null,null,null,null,null,{"$f":"$AB$1","v":"Categoria"},null,null,null,{"$f":"$AA$1","v":"32º Campeonato Brasileiro Individual"},null,null,null,null,null,null,null,{"$f":"$AB$1","v":"Categoria"}]
[null,null,{"$f":"$AA$94","v":"1a Fase"},null,null,null,null,null,null,null,{"$f":"$AB$94","v":"SUB-18"},null,null,null,{"$f":"$AA$95","v":"1a Fase"},null,null,null,null,null,null,null,{"$f":"$AB$95","v":"SUB-18"}]
[]
[1,null,"Grupo",null,{"$f":"$AF$94","v":"IGOR COSTA (SP)"},null,null,null,null,null,null,null,null,null,"Grupo",null,{"$f":"$AF$95","v":"VITOR HUGO (SP)"}]
[1,null,{"$f":"$AC$94","v":1},null,null,null,null,null,null,null,null,null,null,null,{"$f":"$AC$95","v":1}]
[]
[]
[null,null,"Rodada",null,null,null,null,null,null,null,null,null,null,null,"Rodada"]
[null,null,{"$f":"$AD$94","v":12},null,null,null,null,null,null,null,null,null,null,null,{"$f":"$AD$95","v":12}]
[1,null,null,null,{"$f":"$AG$94","v":"PEDRINHO (SP)"},null,null,null,null,null,null,null,null,null,null,null,{"$f":"$AG$95","v":"WALLACE RINCO (SP)"}]
[1]
[null,null,"Mesa",null,null,null,null,null,null,null,null,null,null,null,"Mesa"]
[null,null,{"$f":"$AE$94","v":62},null,null,null,null,null,null,null,null,null,null,null,{"$f":"$AE$95","v":61}]
[]
[]
[]
[null,null,{"$f":"$AA$1","v":"32º Campeonato Brasileiro Individual"},null,null,null,null,null,null,null,{"$f":"$AB$1","v":"Categoria"},null,null,null,{"$f":"$AA$1","v":"32º Campeonato Brasileiro Individual"},null,null,null,null,null,null,null,{"$f":"$AB$1","v":"Categoria"}]
[null,null,{"$f":"$AA$96","v":"1a Fase"},null,null,null,null,null,null,null,{"$f":"$AB$96","v":"SUB-18"},null,null,null,{"$f":"$AA$97","v":"1a Fase"},null,null,null,null,null,null,null,{"$f":"$AB$97","v":"SUB-18"}]
[]
[1,null,"Grupo",null,{"$f":"$AF$96","v":"TUSURINHA (SP)"},null,null,null,null,null,null,null,null,null,"Grupo",null,{"$f":"$AF$97","v":"LUIZ GULHERME (SP)"}]
[1,null,{"$f":"$AC$96","v":1},null,null,null,null,null,null,null,null,null,null,null,{"$f":"$AC$97","v":1}]
[]
[]
[null,null,"Rodada",null,null,null,null,null,null,null,null,null,null,null,"Rodada"]
[null,null,{"$f":"$AD$96","v":12},null,null,null,null,null,null,null,null,null,null,null,{"$f":"$AD$97","v":12}]
[1,null,null,null,{"$f":"$AG$96","v":"DAVI ANDRADE (SP)"},null,null,null,null,null,null,null,null,null,null,null,{"$f":"$AG$97","v":"MELLI JR (SP)"}]
[1]
[null,null,"Mesa",null,null,null,null,null,null,null,null,null,null,null,"Mesa"]
[null,null,{"$f":"$AE$96","v":63},null,null,null,null,null,null,null,null,null,null,null,{"$f":"$AE$97","v":57}]
[]
[]
[]
[null,null,{"$f":"$AA$1","v":"32º Campeonato Brasileiro Individual"},null,null,null,null,null,null,null,{"$f":"$AB$1","v":"Categoria"},null,null,null,{"$f":"$AA$1","v":"32º Campeonato Brasileiro Individual"},null,null,null,null,null,null,null,{"$f":"$AB$1","v":"Categoria"}]
[null,null,{"$f":"$AA$98","v":"1a Fase"},null,null,null,null,null,null,null,{"$f":"$AB$98","v":"SUB-18"},null,null,null,{"$f":"$AA$99","v":"1a Fase"},null,null,null,null,null,null,null,{"$f":"$AB$99","v":"SUB-18"}]
[]
[1,null,"Grupo",null,{"$f":"$AF$98","v":"LEO LIMA (SP)"},null,null,null,null,null,null,null,null,null,"Grupo",null,{"$f":"$AF$99","v":"PEDRO ANTONIO (SP)"}]
[1,null,{"$f":"$AC$98","v":1},null,null,null,null,null,null,null,null,null,null,null,{"$f":"$AC$99","v":1}]
[]
[]
[null,null,"Rodada",null,null,null,null,null,null,null,null,null,null,null,"Rodada"]
[null,null,{"$f":"$AD$98","v":13},null,null,null,null,null,null,null,null,null,null,null,{"$f":"$AD$99","v":13}]
[1,null,null,null,{"$f":"$AG$98","v":"LINNO BALA (PE)"},null,null,null,null,null,null,null,null,null,null,null,{"$f":"$AG$99","v":"DANIEL COUTO (RJ)"}]
[1]
[null,null,"Mesa",null,null,null,null,null,null,null,null,null,null,null,"Mesa"]
[null,null,{"$f":"$AE$98","v":60},null,null,null,null,null,null,null,null,null,null,null,{"$f":"$AE$99","v":61}]
[]
[]
[]
[null,null,{"$f":"$AA$1","v":"32º Campeonato Brasileiro Individual"},null,null,null,null,null,null,null,{"$f":"$AB$1","v":"Categoria"},null,null,null,{"$f":"$AA$1","v":"32º Campeonato Brasileiro Individual"},null,null,null,null,null,null,null,{"$f":"$AB$1","v":"Categoria"}]
[null,null,{"$f":"$AA$100","v":"1a Fase"},null,null,null,null,null,null,null,{"$f":"$AB$100","v":"SUB-18"},null,null,null,{"$f":"$AA$101","v":"1a Fase"},null,null,null,null,null,null,null,{"$f":"$AB$101","v":"SUB-18"}]
[]
[1,null,"Grupo",null,{"$f":"$AF$100","v":"TUGUINHA (SP)"},null,null,null,null,null,null,null,null,null,"Grupo",null,{"$f":"$AF$101","v":"CAROL (SP)"}]
[1,null,{"$f":"$AC$100","v":1},null,null,null,null,null,null,null,null,null,null,null,{"$f":"$AC$101","v":1}]
[]
[]
[null,null,"Rodada",null,null,null,null,null,null,null,null,null,null,null,"Rodada"]
[null,null,{"$f":"$AD$100","v":13},null,null,null,null,null,null,null,null,null,null,null,{"$f":"$AD$101","v":13}]
[1,null,null,null,{"$f":"$AG$100","v":"VERISSON (PE)"},null,null,null,null,null,null,null,null,null,null,null,{"$f":"$AG$101","v":"PEDRINHO (SP)"}]
[1]
[null,null,"Mesa",null,null,null,null,null,null,null,null,null,null,null,"Mesa"]
[null,null,{"$f":"$AE$100","v":62},null,null,null,null,null,null,null,null,null,null,null,{"$f":"$AE$101","v":63}]
[]
[]
[]
[null,null,{"$f":"$AA$1","v":"32º Campeonato Brasileiro Individual"},null,null,null,null,null,null,null,{"$f":"$AB$1","v":"Categoria"},null,null,null,{"$f":"$AA$1","v":"32º Campeonato Brasileiro Individual"},null,null,null,null,null,null,null,{"$f":"$AB$1","v":"Categoria"}]
[null,null,{"$f":"$AA$102","v":"1a Fase"},null,null,null,null,null,null,null,{"$f":"$AB$102","v":"SUB-18"},null,null,null,{"$f":"$AA$103","v":"1a Fase"},null,null,null,null,null,null,null,{"$f":"$AB$103","v":"SUB-18"}]
[]
[1,null,"Grupo",null,{"$f":"$AF$102","v":"IGOR COSTA (SP)"},null,null,null,null,null,null,null,null,null,"Grupo",null,{"$f":"$AF$103","v":"VITOR HUGO (SP)"}]
[1,null,{"$f":"$AC$102","v":1},null,null,null,null,null,null,null,null,null,null,null,{"$f":"$AC$103","v":1}]
[]
[]
[null,null,"Rodada",null,null,null,null,null,null,null,null,null,null,null,"Rodada"]
[null,null,{"$f":"$AD$102","v":13},null,null,null,null,null,null,null,null,null,null,null,{"$f":"$AD$103","v":13}]
[1,null,null,null,{"$f":"$AG$102","v":"WALLACE RINCO (SP)"},null,null,null,null,null,null,null,null,null,null,null,{"$f":"$AG$103","v":"DAVI ANDRADE (SP)"}]
[1]
[null,null,"Mesa",null,null,null,null,null,null,null,null,null,null,null,"Mesa"]
[null,null,{"$f":"$AE$102","v":64},null,null,null,null,null,null,null,null,null,null,null,{"$f":"$AE$103","v":57}]
[]
[]
[]
[null,null,{"$f":"$AA$1","v":"32º Campeonato Brasileiro Individual"},null,null,null,null,null,null,null,{"$f":"$AB$1","v":"Categoria"},null,null,null,{"$f":"$AA$1","v":"32º Campeonato Brasileiro Individual"},null,null,null,null,null,null,null,{"$f":"$AB$1","v":"Categoria"}]
[null,null,{"$f":"$AA$104","v":"1a Fase"},null,null,null,null,null,null,null,{"$f":"$AB$104","v":"SUB-18"},null,null,null,{"$f":"$AA$105","v":"1a Fase"},null,null,null,null,null,null,null,{"$f":"$AB$105","v":"SUB-18"}]
[]
[1,null,"Grupo",null,{"$f":"$AF$104","v":"TUSURINHA (SP)"},null,null,null,null,null,null,null,null,null,"Grupo",null,{"$f":"$AF$105","v":"LUIZ GULHERME (SP)"}]
[1,null,{"$f":"$AC$104","v":1},null,null,null,null,null,null,null,null,null,null,null,{"$f":"$AC$105","v":1}]
[]
[]
[null,null,"Rodada",null,null,null,null,null,null,null,null,null,null,null,"Rodada"]
[null,null,{"$f":"$AD$104","v":13},null,null,null,null,null,null,null,null,null,null,null,{"$f":"$AD$105","v":13}]
[1,null,null,null,{"$f":"$AG$104","v":"MELLI JR (SP)"},null,null,null,null,null,null,null,null,null,null,null,{"$f":"$AG$105","v":"RODRIGO (PE)"}]
[1]
[null,null,"Mesa",null,null,null,null,null,null,null,null,null,null,null,"Mesa"]
[null,null,{"$f":"$AE$104","v":58},null,null,null,null,null,null,null,null,null,null,null,{"$f":"$AE$105","v":59}]
[]
[]
[]
[null,null,{"$f":"$AA$1","v":"32º Campeonato Brasileiro Individual"},null,null,null,null,null,null,null,{"$f":"$AB$1","v":"Categoria"},null,null,null,{"$f":"$AA$1","v":"32º Campeonato Brasileiro Individual"},null,null,null,null,null,null,null,{"$f":"$AB$1","v":"Categoria"}]
[null,null,{"$f":"$AA$106","v":"1a Fase"},null,null,null,null,null,null,null,{"$f":"$AB$106","v":"SUB-18"},null,null,null,{"$f":"$AA$107","v":"1a Fase"},null,null,null,null,null,null,null,{"$f":"$AB$107","v":"SUB-18"}]
[]
[1,null,"Grupo",null,{"$f":"$AF$106","v":"LEO LIMA (SP)"},null,null,null,null,null,null,null,null,null,"Grupo",null,{"$f":"$AF$107","v":"PEDRO ANTONIO (SP)"}]
[1,null,{"$f":"$AC$106","v":1},null,null,null,null,null,null,null,null,null,null,null,{"$f":"$AC$107","v":1}]
[]
[]
[null,null,"Rodada",null,null,null,null,null,null,null,null,null,null,null,"Rodada"]
[null,null,{"$f":"$AD$106","v":14},null,null,null,null,null,null,null,null,null,null,null,{"$f":"$AD$107","v":14}]
[1,null,null,null,{"$f":"$AG$106","v":"DANIEL COUTO (RJ)"},null,null,null,null,null,null,null,null,null,null,null,{"$f":"$AG$107","v":"VERISSON (PE)"}]
[1]
[null,null,"Mesa",null,null,null,null,null,null,null,null,null,null,null,"Mesa"]
[null,null,{"$f":"$AE$106","v":63},null,null,null,null,null,null,null,null,null,null,null,{"$f":"$AE$107","v":64}]
[]
[]
[]
[null,null,{"$f":"$AA$1","v":"32º Campeonato Brasileiro Individual"},null,null,null,null,null,null,null,{"$f":"$AB$1","v":"Categoria"},null,null,null,{"$f":"$AA$1","v":"32º Campeonato Brasileiro Individual"},null,null,null,null,null,null,null,{"$f":"$AB$1","v":"Categoria"}]
[null,null,{"$f":"$AA$108","v":"1a Fase"},null,null,null,null,null,null,null,{"$f":"$AB$108","v":"SUB-18"},null,null,null,{"$f":"$AA$109","v":"1a Fase"},null,null,null,null,null,null,null,{"$f":"$AB$109","v":"SUB-18"}]
[]
[1,null,"Grupo",null,{"$f":"$AF$108","v":"TUGUINHA (SP)"},null,null,null,null,null,null,null,null,null,"Grupo",null,{"$f":"$AF$109","v":"CAROL (SP)"}]
[1,null,{"$f":"$AC$108","v":1},null,null,null,null,null,null,null,null,null,null,null,{"$f":"$AC$109","v":1}]
[]
[]
[null,null,"Rodada",null,null,null,null,null,null,null,null,null,null,null,"Rodada"]
[null,null,{"$f":"$AD$108","v":14},null,null,null,null,null,null,null,null,null,null,null,{"$f":"$AD$109","v":14}]
[1,null,null,null,{"$f":"$AG$108","v":"PEDRINHO (SP)"},null,null,null,null,null,null,null,null,null,null,null,{"$f":"$AG$109","v":"WALLACE RINCO (SP)"}]
[1]
[null,null,"Mesa",null,null,null,null,null,null,null,null,null,null,null,"Mesa"]
[null,null,{"$f":"$AE$108","v":58},null,null,null,null,null,null,null,null,null,null,null,{"$f":"$AE$109","v":57}]
[]
[]
[]
[null,null,{"$f":"$AA$1","v":"32º Campeonato Brasileiro Individual"},null,null,null,null,null,null,null,{"$f":"$AB$1","v":"Categoria"},null,null,null,{"$f":"$AA$1","v":"32º Campeonato Brasileiro Individual"},null,null,null,null,null,null,null,{"$f":"$AB$1","v":"Categoria"}]
[null,null,{"$f":"$AA$110","v":"1a Fase"},null,null,null,null,null,null,null,{"$f":"$AB$110","v":"SUB-18"},null,null,null,{"$f":"$AA$111","v":"1a Fase"},null,null,null,null,null,null,null,{"$f":"$AB$111","v":"SUB-18"}]
[]
[1,null,"Grupo",null,{"$f":"$AF$110","v":"IGOR COSTA (SP)"},null,null,null,null,null,null,null,null,null,"Grupo",null,{"$f":"$AF$111","v":"VITOR HUGO (SP)"}]
[1,null,{"$f":"$AC$110","v":1},null,null,null,null,null,null,null,null,null,null,null,{"$f":"$AC$111","v":1}]
[]
[]
[null,null,"Rodada",null,null,null,null,null,null,null,null,null,null,null,"Rodada"]
[null,null,{"$f":"$AD$110","v":14},null,null,null,null,null,null,null,null,null,null,null,{"$f":"$AD$111","v":14}]
[1,null,null,null,{"$f":"$AG$110","v":"DAVI ANDRADE (SP)"},null,null,null,null,null,null,null,null,null,null,null,{"$f":"$AG$111","v":"MELLI JR (SP)"}]
[1]
[null,null,"Mesa",null,null,null,null,null,null,null,null,null,null,null,"Mesa"]
[null,null,{"$f":"$AE$110","v":59},null,null,null,null,null,null,null,null,null,null,null,{"$f":"$AE$111","v":60}]
[]
[]
[]
[null,null,{"$f":"$AA$1","v":"32º Campeonato Brasileiro Individual"},null,null,null,null,null,null,null,{"$f":"$AB$1","v":"Categoria"},null,null,null,{"$f":"$AA$1","v":"32º Campeonato Brasileiro Individual"},null,null,null,null,null,null,null,{"$f":"$AB$1","v":"Categoria"}]
[null,null,{"$f":"$AA$112","v":"1a Fase"},null,null,null,null,null,null,null,{"$f":"$AB$112","v":"SUB-18"},null,null,null,{"$f":"$AA$113","v":"1a Fase"},null,null,null,null,null,null,null,{"$f":"$AB$113","v":"SUB-18"}]
[]
[1,null,"Grupo",null,{"$f":"$AF$112","v":"TUSURINHA (SP)"},null,null,null,null,null,null,null,null,null,"Grupo",null,{"$f":"$AF$113","v":"LUIZ GULHERME (SP)"}]
[1,null,{"$f":"$AC$112","v":1},null,null,null,null,null,null,null,null,null,null,null,{"$f":"$AC$113","v":1}]
[]
[]
[null,null,"Rodada",null,null,null,null,null,null,null,null,null,null,null,"Rodada"]
[null,null,{"$f":"$AD$112","v":14},null,null,null,null,null,null,null,null,null,null,null,{"$f":"$AD$113","v":14}]
[1,null,null,null,{"$f":"$AG$112","v":"RODRIGO (PE)"},null,null,null,null,null,null,null,null,null,null,null,{"$f":"$AG$113","v":"LINNO BALA (PE)"}]
[1]
[null,null,"Mesa",null,null,null,null,null,null,null,null,null,null,null,"Mesa"]
[null,null,{"$f":"$AE$112","v":61},null,null,null,null,null,null,null,null,null,null,null,{"$f":"$AE$113","v":62}]
[]
[]
[]
[null,null,{"$f":"$AA$1","v":"32º Campeonato Brasileiro Individual"},null,null,null,null,null,null,null,{"$f":"$AB$1","v":"Categoria"},null,null,null,{"$f":"$AA$1","v":"32º Campeonato Brasileiro Individual"},null,null,null,null,null,null,null,{"$f":"$AB$1","v":"Categoria"}]
[null,null,{"$f":"$AA$114","v":"1a Fase"},null,null,null,null,null,null,null,{"$f":"$AB$114","v":"SUB-18"},null,null,null,{"$f":"$AA$115","v":"1a Fase"},null,null,null,null,null,null,null,{"$f":"$AB$115","v":"SUB-18"}]
[]
[1,null,"Grupo",null,{"$f":"$AF$114","v":"LEO LIMA (SP)"},null,null,null,null,null,null,null,null,null,"Grupo",null,{"$f":"$AF$115","v":"PEDRO ANTONIO (SP)"}]
[1,null,{"$f":"$AC$114","v":1},null,null,null,null,null,null,null,null,null,null,null,{"$f":"$AC$115","v":1}]
[]
[]
[null,null,"Rodada",null,null,null,null,null,null,null,null,null,null,null,"Rodada"]
[null,null,{"$f":"$AD$114","v":15},null,null,null,null,null,null,null,null,null,null,null,{"$f":"$AD$115","v":15}]
[1,null,null,null,{"$f":"$AG$114","v":"VERISSON (PE)"},null,null,null,null,null,null,null,null,null,null,null,{"$f":"$AG$115","v":"PEDRINHO (SP)"}]
[1]
[null,null,"Mesa",null,null,null,null,null,null,null,null,null,null,null,"Mesa"]
[null,null,{"$f":"$AE$114","v":58},null,null,null,null,null,null,null,null,null,null,null,{"$f":"$AE$115","v":59}]
[]
[]
[]
[null,null,{"$f":"$AA$1","v":"32º Campeonato Brasileiro Individual"},null,null,null,null,null,null,null,{"$f":"$AB$1","v":"Categoria"},null,null,null,{"$f":"$AA$1","v":"32º Campeonato Brasileiro Individual"},null,null,null,null,null,null,null,{"$f":"$AB$1","v":"Categoria"}]
[null,null,{"$f":"$AA$116","v":"1a Fase"},null,null,null,null,null,null,null,{"$f":"$AB$116","v":"SUB-18"},null,null,null,{"$f":"$AA$117","v":"1a Fase"},null,null,null,null,null,null,null,{"$f":"$AB$117","v":"SUB-18"}]
[]
[1,null,"Grupo",null,{"$f":"$AF$116","v":"TUGUINHA (SP)"},null,null,null,null,null,null,null,null,null,"Grupo",null,{"$f":"$AF$117","v":"CAROL (SP)"}]
[1,null,{"$f":"$AC$116","v":1},null,null,null,null,null,null,null,null,null,null,null,{"$f":"$AC$117","v":1}]
[]
[]
[null,null,"Rodada",null,null,null,null,null,null,null,null,null,null,null,"Rodada"]
[null,null,{"$f":"$AD$116","v":15},null,null,null,null,null,null,null,null,null,null,null,{"$f":"$AD$117","v":15}]
[1,null,null,null,{"$f":"$AG$116","v":"WALLACE RINCO (SP)"},null,null,null,null,null,null,null,null,null,null,null,{"$f":"$AG$117","v":"DAVI ANDRADE (SP)"}]
[1]
[null,null,"Mesa",null,null,null,null,null,null,null,null,null,null,null,"Mesa"]
[null,null,{"$f":"$AE$116","v":60},null,null,null,null,null,null,null,null,null,null,null,{"$f":"$AE$117","v":61}]
[]
[]
[]
[null,null,{"$f":"$AA$1","v":"32º Campeonato Brasileiro Individual"},null,null,null,null,null,null,null,{"$f":"$AB$1","v":"Categoria"},null,null,null,{"$f":"$AA$1","v":"32º Campeonato Brasileiro Individual"},null,null,null,null,null,null,null,{"$f":"$AB$1","v":"Categoria"}]
[null,null,{"$f":"$AA$118","v":"1a Fase"},null,null,null,null,null,null,null,{"$f":"$AB$118","v":"SUB-18"},null,null,null,{"$f":"$AA$119","v":"1a Fase"},null,null,null,null,null,null,null,{"$f":"$AB$119","v":"SUB-18"}]
[]
[1,null,"Grupo",null,{"$f":"$AF$118","v":"IGOR COSTA (SP)"},null,null,null,null,null,null,null,null,null,"Grupo",null,{"$f":"$AF$119","v":"VITOR HUGO (SP)"}]
[1,null,{"$f":"$AC$118","v":1},null,null,null,null,null,null,null,null,null,null,null,{"$f":"$AC$119","v":1}]
[]
[]
[null,null,"Rodada",null,null,null,null,null,null,null,null,null,null,null,"Rodada"]
[null,null,{"$f":"$AD$118","v":15},null,null,null,null,null,null,null,null,null,null,null,{"$f":"$AD$119","v":15}]
[1,null,null,null,{"$f":"$AG$118","v":"MELLI JR (SP)"},null,null,null,null,null,null,null,null,null,null,null,{"$f":"$AG$119","v":"RODRIGO (PE)"}]
[1]
[null,null,"Mesa",null,null,null,null,null,null,null,null,null,null,null,"Mesa"]
[null,null,{"$f":"$AE$118","v":63},null,null,null,null,null,null,null,null,null,null,null,{"$f":"$AE$119","v":62}]
[]
[]
[]
[null,null,{"$f":"$AA$1","v":"32º Campeonato Brasileiro Individual"},null,null,null,null,null,null,null,{"$f":"$AB$1","v":"Categoria"},null,null,null,{"$f":"$AA$1","v":"32º Campeonato Brasileiro Individual"},null,null,null,null,null,null,null,{"$f":"$AB$1","v":"Categoria"}]
[null,null,{"$f":"$AA$120","v":"1a Fase"},null,null,null,null,null,null,null,{"$f":"$AB$120","v":"SUB-18"},null,null,null,{"$f":"$AA$121","v":"1a Fase"},null,null,null,null,null,null,null,{"$f":"$AB$121","v":"SUB-18"}]
[]
[1,null,"Grupo",null,{"$f":"$AF$120","v":"TUSURINHA (SP)"},null,null,null,null,null,null,null,null,null,"Grupo",null,{"$f":"$AF$121","v":"LUIZ GULHERME (SP)"}]
[1,null,{"$f":"$AC$120","v":1},null,null,null,null,null,null,null,null,null,null,null,{"$f":"$AC$121","v":1}]
[]
[]
[null,null,"Rodada",null,null,null,null,null,null,null,null,null,null,null,"Rodada"]
[null,null,{"$f":"$AD$120","v":15},null,null,null,null,null,null,null,null,null,null,null,{"$f":"$AD$121","v":15}]
[1,null,null,null,{"$f":"$AG$120","v":"LINNO BALA (PE)"},null,null,null,null,null,null,null,null,null,null,null,{"$f":"$AG$121","v":"DANIEL COUTO (RJ)"}]
[1]
[null,null,"Mesa",null,null,null,null,null,null,null,null,null,null,null,"Mesa"]
[null,null,{"$f":"$AE$120","v":64},null,null,null,null,null,null,null,null,null,null,null,{"$f":"$AE$121","v":57}]

{"sheet":"SUM-QF","index":10,"n_rows":30,"n_cols":33,"rows_kept":30,"cut":false,"hidden":false,"merged":[[27,22,29,22],[29,2,30,2],[29,14,30,14],[20,4,21,8],[20,16,21,20],[21,2,22,2],[21,10,23,10],[21,14,22,14],[21,22,23,22],[25,2,26,2],[25,14,26,14],[26,4,27,8],[26,16,27,20],[27,10,29,10],[11,22,13,22],[13,2,14,2],[13,14,14,14],[4,4,5,8],[4,16,5,20],[5,2,6,2],[5,10,7,10],[5,14,6,14],[5,22,7,22],[9,2,10,2],[9,14,10,14],[10,4,11,8],[10,16,11,20],[11,10,13,10]]}
[null,null,null,null,null,null,null,null,null,null,null,null,null,null,null,null,null,null,null,null,null,null,null,null,null,"N.o",{"$f":"'SUM-F1'!$AA$1","v":"32º Campeonato Brasileiro Individual"},"Categoria","Grp","Rod","Mesa","Jog1","Jog2"]
[null,null,{"$f":"$AA$1","v":"32º Campeonato Brasileiro Individual"},null,null,null,null,null,null,null,{"$f":"$AB$1","v":"Categoria"},null,null,null,{"$f":"$AA$1","v":"32º Campeonato Brasileiro Individual"},null,null,null,null,null,null,null,{"$f":"$AB$1","v":"Categoria"},null,null,1,"Quartas de Final","SUB-18",1,"QF",{"$f":"QF!D9","v":"57"},{"$f":"QF!E9","v":"LEO LIMA (SP)"},{"$f":"QF!L9","v":"LUIZ GULHERME (SP)"}]
[null,null,{"$f":"$AA$2","v":"Quartas de Final"},null,null,null,null,null,null,null,{"$f":"$AB$2","v":"SUB-18"},null,null,null,{"$f":"$AA$3","v":"Quartas de Final"},null,null,null,null,null,null,null,{"$f":"$AB$3","v":"SUB-18"},null,null,2,{"$f":"AA2","v":"Quartas de Final"},"SUB-18",1,"QF",{"$f":"QF!D12","v":"58"},{"$f":"QF!E12","v":"DANIEL COUTO (RJ)"},{"$f":"QF!L12","v":"TUSURINHA (SP)"}]
[null,null,null,null,null,null,null,null,null,null,null,null,null,null,null,null,null,null,null,null,null,null,null,null,null,3,"Quartas de Final","SUB-18",1,"QF",{"$f":"QF!D15","v":"59"},{"$f":"QF!E15","v":"WALLACE RINCO (SP)"},{"$f":"QF!L15","v":"IGOR COSTA (SP)"}]
[1,null,"Grupo",null,{"$f":"$AF$2","v":"LEO LIMA (SP)"},null,null,null,null,null,null,null,null,null,"Grupo",null,{"$f":"$AF$3","v":"DANIEL COUTO (RJ)"},null,null,null,null,null,null,null,null,4,"Quartas de Final","SUB-18",1,"QF",{"$f":"QF!D18","v":"60"},{"$f":"QF!E18","v":"RODRIGO (PE)"},{"$f":"QF!L18","v":"MELLI JR (SP)"}]
[1,null,{"$f":"$AC$2","v":1},null,null,null,null,null,null,null,null,null,null,null,{"$f":"$AC$3","v":1}]
[]
[]
[null,null,"Rodada",null,null,null,null,null,null,null,null,null,null,null,"Rodada"]
[null,null,{"$f":"$AD$2","v":"QF"},null,null,null,null,null,null,null,null,null,null,null,{"$f":"$AD$3","v":"QF"}]
[1,null,null,null,{"$f":"$AG$2","v":"LUIZ GULHERME (SP)"},null,null,null,null,null,null,null,null,null,null,null,{"$f":"$AG$3","v":"TUSURINHA (SP)"}]
[1]
[null,null,"Mesa",null,null,null,null,null,null,null,null,null,null,null,"Mesa"]
[null,null,{"$f":"$AE$2","v":"57"},null,null,null,null,null,null,null,null,null,null,null,{"$f":"$AE$3","v":"58"}]
[]
[]
[]
[null,null,{"$f":"$AA$1","v":"32º Campeonato Brasileiro Individual"},null,null,null,null,null,null,null,{"$f":"$AB$1","v":"Categoria"},null,null,null,{"$f":"$AA$1","v":"32º Campeonato Brasileiro Individual"},null,null,null,null,null,null,null,{"$f":"$AB$1","v":"Categoria"}]
[null,null,{"$f":"$AA$4","v":"Quartas de Final"},null,null,null,null,null,null,null,{"$f":"$AB$4","v":"SUB-18"},null,null,null,{"$f":"$AA$5","v":"Quartas de Final"},null,null,null,null,null,null,null,{"$f":"$AB$5","v":"SUB-18"}]
[]
[1,null,"Grupo",null,{"$f":"$AF$4","v":"WALLACE RINCO (SP)"},null,null,null,null,null,null,null,null,null,"Grupo",null,{"$f":"$AF$5","v":"RODRIGO (PE)"}]
[1,null,{"$f":"$AC$4","v":1},null,null,null,null,null,null,null,null,null,null,null,{"$f":"$AC$5","v":1}]
[]
[]
[null,null,"Rodada",null,null,null,null,null,null,null,null,null,null,null,"Rodada"]
[null,null,{"$f":"$AD$4","v":"QF"},null,null,null,null,null,null,null,null,null,null,null,{"$f":"$AD$5","v":"QF"}]
[1,null,null,null,{"$f":"$AG$4","v":"IGOR COSTA (SP)"},null,null,null,null,null,null,null,null,null,null,null,{"$f":"$AG$5","v":"MELLI JR (SP)"}]
[1]
[null,null,"Mesa",null,null,null,null,null,null,null,null,null,null,null,"Mesa"]
[null,null,{"$f":"$AE$4","v":"59"},null,null,null,null,null,null,null,null,null,null,null,{"$f":"$AE$5","v":"60"}]

{"sheet":"SUM-SF","index":11,"n_rows":14,"n_cols":33,"rows_kept":14,"cut":false,"hidden":false,"merged":[[11,22,13,22],[13,2,14,2],[13,14,14,14],[4,4,5,8],[4,16,5,20],[5,2,6,2],[5,10,7,10],[5,14,6,14],[5,22,7,22],[9,2,10,2],[9,14,10,14],[10,4,11,8],[10,16,11,20],[11,10,13,10]]}
[null,null,null,null,null,null,null,null,null,null,null,null,null,null,null,null,null,null,null,null,null,null,null,null,null,"N.o",{"$f":"'SUM-F1'!$AA$1","v":"32º Campeonato Brasileiro Individual"},"Categoria","Grp","Rod","Mesa","Jog1","Jog2"]
[null,null,{"$f":"$AA$1","v":"32º Campeonato Brasileiro Individual"},null,null,null,null,null,null,null,{"$f":"$AB$1","v":"Categoria"},null,null,null,{"$f":"$AA$1","v":"32º Campeonato Brasileiro Individual"},null,null,null,null,null,null,null,{"$f":"$AB$1","v":"Categoria"},null,null,1,"Semifinal","SUB-18",1,"SF",{"$f":"SF!D9","v":"61"},{"$f":"SF!E9","v":"LEO LIMA (SP)"},{"$f":"SF!L9","v":"RODRIGO (PE)"}]
[null,null,{"$f":"$AA$2","v":"Semifinal"},null,null,null,null,null,null,null,{"$f":"$AB$2","v":"SUB-18"},null,null,null,{"$f":"$AA$3","v":"Semifinal"},null,null,null,null,null,null,null,{"$f":"$AB$3","v":"SUB-18"},null,null,2,{"$f":"AA2","v":"Semifinal"},{"$f":"AB2","v":"SUB-18"},1,"SF",{"$f":"SF!D12","v":62},{"$f":"SF!E12","v":"DANIEL COUTO (RJ)"},{"$f":"SF!L12","v":"WALLACE RINCO (SP)"}]
[]
[1,null,"Grupo",null,{"$f":"$AF$2","v":"LEO LIMA (SP)"},null,null,null,null,null,null,null,null,null,"Grupo",null,{"$f":"$AF$3","v":"DANIEL COUTO (RJ)"}]
[1,null,{"$f":"$AC$2","v":1},null,null,null,null,null,null,null,null,null,null,null,{"$f":"$AC$3","v":1}]
[]
[]
[null,null,"Rodada",null,null,null,null,null,null,null,null,null,null,null,"Rodada"]
[null,null,{"$f":"$AD$2","v":"SF"},null,null,null,null,null,null,null,null,null,null,null,{"$f":"$AD$3","v":"SF"}]
[1,null,null,null,{"$f":"$AG$2","v":"RODRIGO (PE)"},null,null,null,null,null,null,null,null,null,null,null,{"$f":"$AG$3","v":"WALLACE RINCO (SP)"}]
[1]
[null,null,"Mesa",null,null,null,null,null,null,null,null,null,null,null,"Mesa"]
[null,null,{"$f":"$AE$2","v":"61"},null,null,null,null,null,null,null,null,null,null,null,{"$f":"$AE$3","v":62}]

{"sheet":"SUM-FN","index":12,"n_rows":14,"n_cols":33,"rows_kept":14,"cut":false,"hidden":false,"merged":[[11,22,13,22],[13,2,14,2],[13,14,14,14],[4,4,5,8],[4,16,5,20],[5,2,6,2],[5,10,7,10],[5,14,6,14],[5,22,7,22],[9,2,10,2],[9,14,10,14],[10,4,11,8],[10,16,11,20],[11,10,13,10]]}
[null,null,null,null,null,null,null,null,null,null,null,null,null,null,null,null,null,null,null,null,null,null,null,null,null,"N.o",{"$f":"'SUM-F1'!$AA$1","v":"32º Campeonato Brasileiro Individual"},"Categoria","Grp","Rod","Mesa","Jog1","Jog2"]
[null,null,{"$f":"$AA$1","v":"32º Campeonato Brasileiro Individual"},null,null,null,null,null,null,null,{"$f":"$AB$1","v":"Categoria"},null,null,null,{"$f":"$AA$1","v":"32º Campeonato Brasileiro Individual"},null,null,null,null,null,null,null,{"$f":"$AB$1","v":"Categoria"},null,null,1,"Final","SUB-18",1,"FN",{"$f":"F!D9","v":"63"},{"$f":"F!E9","v":"LEO LIMA (SP)"},{"$f":"F!L9","v":"DANIEL COUTO (RJ)"}]
[null,null,{"$f":"$AA$2","v":"Final"},null,null,null,null,null,null,null,{"$f":"$AB$2","v":"SUB-18"},null,null,null,{"$f":"$AA$3","v":"Disputa de 3o Lugar"},null,null,null,null,null,null,null,{"$f":"$AB$3","v":"SUB-18"},null,null,2,"Disputa de 3o Lugar",{"$f":"AB2","v":"SUB-18"},1,"3/4º",{"$f":"F!D16","v":"64"},{"$f":"F!E16","v":"WALLACE RINCO (SP)"},{"$f":"F!L16","v":"RODRIGO (PE)"}]
[]
[1,null,"Grupo",null,{"$f":"$AF$2","v":"LEO LIMA (SP)"},null,null,null,null,null,null,null,null,null,"Grupo",null,{"$f":"$AF$3","v":"WALLACE RINCO (SP)"}]
[1,null,{"$f":"$AC$2","v":1},null,null,null,null,null,null,null,null,null,null,null,{"$f":"$AC$3","v":1}]
[]
[]
[null,null,"Rodada",null,null,null,null,null,null,null,null,null,null,null,"Rodada"]
[null,null,{"$f":"$AD$2","v":"FN"},null,null,null,null,null,null,null,null,null,null,null,{"$f":"$AD$3","v":"3/4º"}]
[1,null,null,null,{"$f":"$AG$2","v":"DANIEL COUTO (RJ)"},null,null,null,null,null,null,null,null,null,null,null,{"$f":"$AG$3","v":"RODRIGO (PE)"}]
[1]
[null,null,"Mesa",null,null,null,null,null,null,null,null,null,null,null,"Mesa"]
[null,null,{"$f":"$AE$2","v":"63"},null,null,null,null,null,null,null,null,null,null,null,{"$f":"$AE$3","v":"64"}]